{"text_format":"1","workbook":"xlsx","n_sheets":17,"sheets":["Resultatskj","Rangering","1","2","3","4","5","6","7","8","9","10","11","12","13","14","15"],"not_rendered":{"charts":0,"images":3,"macros":1,"external_links":0,"defined_names":15,"comments":0,"pivot_tables":0},"unopened":[],"bounds":{"document_bytes":16777216,"sheet_cells":100000,"rows_first":2000,"rows_last":500,"rows_between":2000,"halvings":0,"cell_chars":16384,"cell_head_chars":4096},"cells_cut":0,"cells_raw":0,"read":"whole","date_system":"1900"}

{"sheet":"Resultatskj","index":0,"n_rows":26,"n_cols":13,"rows_kept":26,"cut":false,"hidden":false,"merged":[[25,10,25,12],[24,0,24,12],[23,0,23,12],[1,7,2,9],[5,12,6,12],[5,0,6,0],[5,5,6,5],[5,3,6,3],[5,2,6,2],[5,4,6,4],[0,0,0,12],[3,7,3,9],[3,10,3,11],[1,0,1,1],[2,0,2,1],[2,2,2,5],[3,2,3,5],[3,0,3,1],[1,2,1,3],[1,11,2,12]]}
["RESULTATSKJEMA KLASSE A - NM"]
["Arrangør:",null,null,null,"Prøve nr.:",null,"Sted:",null,null,null,"Dato:"]
["Dommer:"]
["Dommer:",null,null,null,null,null,"Gruppe:","Spor",null,null,"Klasse:",null,"A"]
[]
["Plass:","Kat.","Hundens navn:","Reg.nr.:","Rase:","Klubb:","Poeng","Poeng","Sum","Ikke","God-","Opp-","CERT"]
[null,"nr.:",null,null,null,null,"lydighet:","spes.øv.:","totalt:","godkj.","kjent","rykk"]
[{"$f":"IF(OR($C8=\"\",$J8=\"X\"),\"-\",RANK($I8,$I$8:$I$22,0))","v":"-"},{"$f":"IF(C8=\"\",\"\",1)","v":""},{"$f":"IF('1'!$M$4=\"\",\"\",'1'!$M$4)","v":""},{"$f":"IF('1'!$M$5=\"\",\"\",'1'!$M$5)","v":""},{"$f":"IF('1'!$M$6=\"\",\"\",'1'!$M$6)","v":""},{"$f":"IF('1'!$C$6=\"\",\"\",'1'!$C$6)","v":""},{"$f":"IF('1'!$O$45=0,\"\",'1'!$O$45)","v":""},{"$f":"IF('1'!$O$46=0,\"\",'1'!$O$46)","v":""},{"$f":"IF(C8=\"\",\"\",IF($J8=\"X\",('1'!$O$47*-1),'1'!$O$47))","v":""},{"$f":"IF(OR(C8=\"\",K8=\"X\"),\"\",\"X\")","v":""},{"$f":"IF(C8=\"\",\"\",'1'!$M$49)","v":""},null,{"$f":"IF('1'!$O$49=\"\",\"\",'1'!$O$49)","v":""}]
[{"$f":"IF(OR($C9=\"\",$J9=\"X\"),\"-\",RANK($I9,$I$8:$I$22,0))","v":"-"},{"$f":"IF(C9=\"\",\"\",2)","v":""},{"$f":"IF('2'!$M$4=\"\",\"\",'2'!$M$4)","v":""},{"$f":"IF('2'!$M$5=\"\",\"\",'2'!$M$5)","v":""},{"$f":"IF('2'!$M$6=\"\",\"\",'2'!$M$6)","v":""},{"$f":"IF('2'!$C$6=\"\",\"\",'2'!$C$6)","v":""},{"$f":"IF('2'!$O$45=0,\"\",'2'!$O$45)","v":""},{"$f":"IF('2'!$O$46=0,\"\",'2'!$O$46)","v":""},{"$f":"IF(C9=\"\",\"\",IF($J9=\"X\",('2'!$O$47*-1),'2'!$O$47))","v":""},{"$f":"IF(OR(C9=\"\",K9=\"X\"),\"\",\"X\")","v":""},{"$f":"IF(C9=\"\",\"\",'2'!$M$49)","v":""},null,{"$f":"IF('2'!$O$49=\"\",\"\",'2'!$O$49)","v":""}]
["-",{"$f":"IF(C10=\"\",\"\",3)","v":""},{"$f":"IF('3'!$M$4=\"\",\"\",'3'!$M$4)","v":""},{"$f":"IF('3'!$M$5=\"\",\"\",'3'!$M$5)","v":""},{"$f":"IF('3'!$M$6=\"\",\"\",'3'!$M$6)","v":""},{"$f":"IF('3'!$C$6=\"\",\"\",'3'!$C$6)","v":""},{"$f":"IF('3'!$O$45=0,\"\",'3'!$O$45)","v":""},{"$f":"IF('3'!$O$46=0,\"\",'3'!$O$46)","v":""},{"$f":"IF(C10=\"\",\"\",IF($J10=\"X\",('3'!$O$47*-1),'3'!$O$47))","v":""},{"$f":"IF(OR(C10=\"\",K10=\"X\"),\"\",\"X\")","v":""},{"$f":"IF(C10=\"\",\"\",'3'!$M$49)","v":""},null,{"$f":"IF('3'!$O$49=\"\",\"\",'3'!$O$49)","v":""}]
["-",{"$f":"IF(C11=\"\",\"\",4)","v":""},{"$f":"IF('4'!$M$4=\"\",\"\",'4'!$M$4)","v":""},{"$f":"IF('4'!$M$5=\"\",\"\",'4'!$M$5)","v":""},{"$f":"IF('4'!$M$6=\"\",\"\",'4'!$M$6)","v":""},{"$f":"IF('4'!$C$6=\"\",\"\",'4'!$C$6)","v":""},{"$f":"IF('4'!$O$45=0,\"\",'4'!$O$45)","v":""},{"$f":"IF('4'!$O$46=0,\"\",'4'!$O$46)","v":""},{"$f":"IF(C11=\"\",\"\",IF($J11=\"X\",('4'!$O$47*-1),'4'!$O$47))","v":""},{"$f":"IF(OR(C11=\"\",K11=\"X\"),\"\",\"X\")","v":""},{"$f":"IF(C11=\"\",\"\",'4'!$M$49)","v":""},null,{"$f":"IF('4'!$O$49=\"\",\"\",'4'!$O$49)","v":""}]
["-",{"$f":"IF(C12=\"\",\"\",5)","v":""},{"$f":"IF('5'!$M$4=\"\",\"\",'5'!$M$4)","v":""},{"$f":"IF('5'!$M$5=\"\",\"\",'5'!$M$5)","v":""},{"$f":"IF('5'!$M$6=\"\",\"\",'5'!$M$6)","v":""},{"$f":"IF('5'!$C$6=\"\",\"\",'5'!$C$6)","v":""},{"$f":"IF('5'!$O$45=0,\"\",'5'!$O$45)","v":""},{"$f":"IF('5'!$O$46=0,\"\",'5'!$O$46)","v":""},{"$f":"IF(C12=\"\",\"\",IF($J12=\"X\",('5'!$O$47*-1),'5'!$O$47))","v":""},{"$f":"IF(OR(C12=\"\",K12=\"X\"),\"\",\"X\")","v":""},{"$f":"IF(C12=\"\",\"\",'5'!$M$49)","v":""},null,{"$f":"IF('5'!$O$49=\"\",\"\",'5'!$O$49)","v":""}]
["-",{"$f":"IF(C13=\"\",\"\",6)","v":""},{"$f":"IF('6'!$M$4=\"\",\"\",'6'!$M$4)","v":""},{"$f":"IF('6'!$M$5=\"\",\"\",'6'!$M$5)","v":""},{"$f":"IF('6'!$M$6=\"\",\"\",'6'!$M$6)","v":""},{"$f":"IF('6'!$C$6=\"\",\"\",'6'!$C$6)","v":""},{"$f":"IF('6'!$O$45=0,\"\",'6'!$O$45)","v":""},{"$f":"IF('6'!$O$46=0,\"\",'6'!$O$46)","v":""},{"$f":"IF(C13=\"\",\"\",IF($J13=\"X\",('6'!$O$47*-1),'6'!$O$47))","v":""},{"$f":"IF(OR(C13=\"\",K13=\"X\"),\"\",\"X\")","v":""},{"$f":"IF(C13=\"\",\"\",'6'!$M$49)","v":""},null,{"$f":"IF('6'!$O$49=\"\",\"\",'6'!$O$49)","v":""}]
["-",{"$f":"IF(C14=\"\",\"\",7)","v":""},{"$f":"IF('7'!$M$4=\"\",\"\",'7'!$M$4)","v":""},{"$f":"IF('7'!$M$5=\"\",\"\",'7'!$M$5)","v":""},{"$f":"IF('7'!$M$6=\"\",\"\",'7'!$M$6)","v":""},{"$f":"IF('7'!$C$6=\"\",\"\",'7'!$C$6)","v":""},{"$f":"IF('7'!$O$45=0,\"\",'7'!$O$45)","v":""},{"$f":"IF('7'!$O$46=0,\"\",'7'!$O$46)","v":""},{"$f":"IF(C14=\"\",\"\",IF($J14=\"X\",('7'!$O$47*-1),'7'!$O$47))","v":""},"",{"$f":"IF(C14=\"\",\"\",'7'!$M$49)","v":""},null,{"$f":"IF('7'!$O$49=\"\",\"\",'7'!$O$49)","v":""}]
["-",{"$f":"IF(C15=\"\",\"\",8)","v":""},{"$f":"IF('8'!$M$4=\"\",\"\",'8'!$M$4)","v":""},{"$f":"IF('8'!$M$5=\"\",\"\",'8'!$M$5)","v":""},{"$f":"IF('8'!$M$6=\"\",\"\",'8'!$M$6)","v":""},{"$f":"IF('8'!$C$6=\"\",\"\",'8'!$C$6)","v":""},{"$f":"IF('8'!$O$45=0,\"\",'8'!$O$45)","v":""},{"$f":"IF('8'!$O$46=0,\"\",'8'!$O$46)","v":""},{"$f":"IF(C15=\"\",\"\",IF($J15=\"X\",('8'!$O$47*-1),'8'!$O$47))","v":""},"",{"$f":"IF(C15=\"\",\"\",'8'!$M$49)","v":""},null,{"$f":"IF('8'!$O$49=\"\",\"\",'8'!$O$49)","v":""}]
["-",{"$f":"IF(C16=\"\",\"\",9)","v":""},{"$f":"IF('9'!$M$4=\"\",\"\",'9'!$M$4)","v":""},{"$f":"IF('9'!$M$5=\"\",\"\",'9'!$M$5)","v":""},{"$f":"IF('9'!$M$6=\"\",\"\",'9'!$M$6)","v":""},{"$f":"IF('9'!$C$6=\"\",\"\",'9'!$C$6)","v":""},{"$f":"IF('9'!$O$45=0,\"\",'9'!$O$45)","v":""},{"$f":"IF('9'!$O$46=0,\"\",'9'!$O$46)","v":""},{"$f":"IF(C16=\"\",\"\",IF($J16=\"X\",('9'!$O$47*-1),'9'!$O$47))","v":""},"",{"$f":"IF(C16=\"\",\"\",'9'!$M$49)","v":""},null,{"$f":"IF('9'!$O$49=\"\",\"\",'9'!$O$49)","v":""}]
["-",{"$f":"IF(C17=\"\",\"\",10)","v":""},{"$f":"IF('10'!$M$4=\"\",\"\",'10'!$M$4)","v":""},{"$f":"IF('10'!$M$5=\"\",\"\",'10'!$M$5)","v":""},{"$f":"IF('10'!$M$6=\"\",\"\",'10'!$M$6)","v":""},{"$f":"IF('10'!$C$6=\"\",\"\",'10'!$C$6)","v":""},{"$f":"IF('10'!$O$45=0,\"\",'10'!$O$45)","v":""},{"$f":"IF('10'!$O$46=0,\"\",'10'!$O$46)","v":""},{"$f":"IF(C17=\"\",\"\",IF($J17=\"X\",('10'!$O$47*-1),'10'!$O$47))","v":""},"",{"$f":"IF(C17=\"\",\"\",'10'!$M$49)","v":""},null,{"$f":"IF('10'!$O$49=\"\",\"\",'10'!$O$49)","v":""}]
["-",{"$f":"IF(C18=\"\",\"\",11)","v":""},{"$f":"IF('11'!$M$4=\"\",\"\",'11'!$M$4)","v":""},{"$f":"IF('11'!$M$5=\"\",\"\",'11'!$M$5)","v":""},{"$f":"IF('11'!$M$6=\"\",\"\",'11'!$M$6)","v":""},{"$f":"IF('11'!$C$6=\"\",\"\",'11'!$C$6)","v":""},{"$f":"IF('11'!$O$45=0,\"\",'11'!$O$45)","v":""},{"$f":"IF('11'!$O$46=0,\"\",'11'!$O$46)","v":""},{"$f":"IF(C18=\"\",\"\",IF($J18=\"X\",('11'!$O$47*-1),'11'!$O$47))","v":""},"",{"$f":"IF(C18=\"\",\"\",'11'!$M$49)","v":""},null,{"$f":"IF('11'!$O$49=\"\",\"\",'11'!$O$49)","v":""}]
["-",{"$f":"IF(C19=\"\",\"\",12)","v":""},{"$f":"IF('12'!$M$4=\"\",\"\",'12'!$M$4)","v":""},{"$f":"IF('12'!$M$5=\"\",\"\",'12'!$M$5)","v":""},{"$f":"IF('12'!$M$6=\"\",\"\",'12'!$M$6)","v":""},{"$f":"IF('12'!$C$6=\"\",\"\",'12'!$C$6)","v":""},{"$f":"IF('12'!$O$45=0,\"\",'12'!$O$45)","v":""},{"$f":"IF('12'!$O$46=0,\"\",'12'!$O$46)","v":""},{"$f":"IF(C19=\"\",\"\",IF($J19=\"X\",('12'!$O$47*-1),'12'!$O$47))","v":""},"",{"$f":"IF(C19=\"\",\"\",'12'!$M$49)","v":""},null,{"$f":"IF('12'!$O$49=\"\",\"\",'12'!$O$49)","v":""}]
["-",{"$f":"IF(C20=\"\",\"\",13)","v":""},{"$f":"IF('13'!$M$4=\"\",\"\",'13'!$M$4)","v":""},{"$f":"IF('13'!$M$5=\"\",\"\",'13'!$M$5)","v":""},{"$f":"IF('13'!$M$6=\"\",\"\",'13'!$M$6)","v":""},{"$f":"IF('13'!$C$6=\"\",\"\",'13'!$C$6)","v":""},{"$f":"IF('13'!$O$45=0,\"\",'13'!$O$45)","v":""},{"$f":"IF('13'!$O$46=0,\"\",'13'!$O$46)","v":""},{"$f":"IF(C20=\"\",\"\",IF($J20=\"X\",('13'!$O$47*-1),'13'!$O$47))","v":""},"",{"$f":"IF(C20=\"\",\"\",'13'!$M$49)","v":""},null,{"$f":"IF('13'!$O$49=\"\",\"\",'13'!$O$49)","v":""}]
["-",{"$f":"IF(C21=\"\",\"\",14)","v":""},{"$f":"IF('14'!$M$4=\"\",\"\",'14'!$M$4)","v":""},{"$f":"IF('14'!$M$5=\"\",\"\",'14'!$M$5)","v":""},{"$f":"IF('14'!$M$6=\"\",\"\",'14'!$M$6)","v":""},{"$f":"IF('14'!$C$6=\"\",\"\",'14'!$C$6)","v":""},{"$f":"IF('14'!$O$45=0,\"\",'14'!$O$45)","v":""},{"$f":"IF('14'!$O$46=0,\"\",'14'!$O$46)","v":""},{"$f":"IF(C21=\"\",\"\",IF($J21=\"X\",('14'!$O$47*-1),'14'!$O$47))","v":""},"",{"$f":"IF(C21=\"\",\"\",'14'!$M$49)","v":""},null,{"$f":"IF('14'!$O$49=\"\",\"\",'14'!$O$49)","v":""}]
["-",{"$f":"IF(C22=\"\",\"\",15)","v":""},{"$f":"IF('15'!$M$4=\"\",\"\",'15'!$M$4)","v":""},{"$f":"IF('14'!$M$5=\"\",\"\",'14'!$M$5)","v":""},{"$f":"IF('15'!$M$6=\"\",\"\",'15'!$M$6)","v":""},{"$f":"IF('15'!$C$6=\"\",\"\",'15'!$C$6)","v":""},{"$f":"IF('15'!$O$45=0,\"\",'15'!$O$45)","v":""},{"$f":"IF('15'!$O$46=0,\"\",'15'!$O$46)","v":""},{"$f":"IF(C22=\"\",\"\",IF($J22=\"X\",('15'!$O$47*-1),'15'!$O$47))","v":""},"",{"$f":"IF(C22=\"\",\"\",'15'!$M$49)","v":""},null,{"$f":"IF('15'!$O$49=\"\",\"\",'15'!$O$49)","v":""}]
[]
["Underskrift dommere:"]
[]
["Original til NKK. Kopi til NBF og arrangørklubben.",null,null,null,null,null,null,null,null,null,"B.Strand/A.Bakken 15.07.2015/19.06.2018"]

{"sheet":"Rangering","index":1,"n_rows":21,"n_cols":17,"rows_kept":21,"cut":false,"hidden":false,"merged":[[0,0,0,16],[2,16,3,16],[20,15,20,16],[2,2,3,2],[2,0,3,0],[2,3,3,3],[2,4,3,4],[2,5,3,5],[2,6,3,6]]}
["RESULTATLISTE - NM SPOR 2015"]
[]
["Plass:","Kat.","Fører","Hundens navn:","Reg.nr.:","Rase:","Klubb:","Poeng","Poeng","Poeng","Poeng","Poeng","Sum","Ikke","God-","Opp-","CERT"]
[null,"nr.:",null,null,null,null,null,"lydighet:","spesial","feltsøk","oppsøk","spor","totalt:","godkj.","kjent","rykk"]
[{"$f":"IF(OR($D5=\"\",$N5=\"X\"),\"-\",RANK($M5,$M$5:$M$19,0))","v":"-"},{"$f":"IF(D5=\"\",\"\",3)","v":""},{"$f":"IF('3'!$M$5=\"\",\"\",'3'!$M$5)","v":""},{"$f":"IF('3'!$M$4=\"\",\"\",'3'!$M$4)","v":""},{"$f":"IF('3'!$M$5=\"\",\"\",'3'!$M$5)","v":""},{"$f":"IF('3'!$M$6=\"\",\"\",'3'!$M$6)","v":""},{"$f":"IF('3'!$C$6=\"\",\"\",'3'!$C$6)","v":""},{"$f":"IF('3'!$O$45=0,\"\",'3'!$O$45)","v":""},{"$f":"IF('3'!$O$46=0,\"\",'3'!$O$46)","v":""},{"$f":"IF('3'!$J$27=0,\"\",'3'!$J$27)","v":""},{"$f":"IF('3'!$J$28=0,\"\",'3'!$J$28)","v":""},{"$f":"IF('3'!$J$29=0,\"\",'3'!$J$29)","v":""},{"$f":"IF(D5=\"\",\"\",IF($N5=\"X\",('3'!$O$47*-1),'3'!$O$47))","v":""},{"$f":"IF(OR(D5=\"\",O5=\"X\"),\"\",\"X\")","v":""},{"$f":"IF(D5=\"\",\"\",'3'!$M$49)","v":""},null,{"$f":"IF('3'!$O$49=\"\",\"\",'3'!$O$49)","v":""}]
["-",{"$f":"IF(D6=\"\",\"\",4)","v":""},{"$f":"IF('4'!$M$5=\"\",\"\",'4'!$M$5)","v":""},{"$f":"IF('4'!$M$4=\"\",\"\",'4'!$M$4)","v":""},{"$f":"IF('4'!$M$5=\"\",\"\",'4'!$M$5)","v":""},{"$f":"IF('4'!$M$6=\"\",\"\",'4'!$M$6)","v":""},{"$f":"IF('4'!$C$6=\"\",\"\",'4'!$C$6)","v":""},{"$f":"IF('4'!$O$45=0,\"\",'4'!$O$45)","v":""},{"$f":"IF('4'!$O$46=0,\"\",'4'!$O$46)","v":""},{"$f":"IF('4'!$J$27=0,\"\",'4'!$J$27)","v":""},{"$f":"IF('4'!$J$28=0,\"\",'4'!$J$28)","v":""},{"$f":"IF('4'!$J$29=0,\"\",'4'!$J$29)","v":""},{"$f":"IF(D6=\"\",\"\",IF($N6=\"X\",('4'!$O$47*-1),'4'!$O$47))","v":""},"",{"$f":"IF(D6=\"\",\"\",'4'!$M$49)","v":""},null,{"$f":"IF('4'!$O$49=\"\",\"\",'4'!$O$49)","v":""}]
["-",{"$f":"IF(D7=\"\",\"\",5)","v":""},{"$f":"IF('5'!$M$5=\"\",\"\",'5'!$M$5)","v":""},{"$f":"IF('5'!$M$4=\"\",\"\",'5'!$M$4)","v":""},{"$f":"IF('5'!$M$5=\"\",\"\",'5'!$M$5)","v":""},{"$f":"IF('5'!$M$6=\"\",\"\",'5'!$M$6)","v":""},{"$f":"IF('5'!$C$6=\"\",\"\",'5'!$C$6)","v":""},{"$f":"IF('5'!$O$45=0,\"\",'5'!$O$45)","v":""},{"$f":"IF('5'!$O$46=0,\"\",'5'!$O$46)","v":""},{"$f":"IF('5'!$J$27=0,\"\",'5'!$J$27)","v":""},{"$f":"IF('5'!$J$28=0,\"\",'5'!$J$28)","v":""},{"$f":"IF('5'!$J$29=0,\"\",'5'!$J$29)","v":""},{"$f":"IF(D7=\"\",\"\",IF($N7=\"X\",('5'!$O$47*-1),'5'!$O$47))","v":""},"",{"$f":"IF(D7=\"\",\"\",'5'!$M$49)","v":""},null,{"$f":"IF('5'!$O$49=\"\",\"\",'5'!$O$49)","v":""}]
["-",{"$f":"IF(D8=\"\",\"\",6)","v":""},{"$f":"IF('6'!$M$5=\"\",\"\",'6'!$M$5)","v":""},{"$f":"IF('6'!$M$4=\"\",\"\",'6'!$M$4)","v":""},{"$f":"IF('6'!$M$5=\"\",\"\",'6'!$M$5)","v":""},{"$f":"IF('6'!$M$6=\"\",\"\",'6'!$M$6)","v":""},{"$f":"IF('6'!$C$6=\"\",\"\",'6'!$C$6)","v":""},{"$f":"IF('6'!$O$45=0,\"\",'6'!$O$45)","v":""},{"$f":"IF('6'!$O$46=0,\"\",'6'!$O$46)","v":""},{"$f":"IF('6'!$J$27=0,\"\",'6'!$J$27)","v":""},{"$f":"IF('6'!$J$28=0,\"\",'6'!$J$28)","v":""},{"$f":"IF('6'!$J$29=0,\"\",'6'!$J$29)","v":""},{"$f":"IF(D8=\"\",\"\",IF($N8=\"X\",('6'!$O$47*-1),'6'!$O$47))","v":""},"",{"$f":"IF(D8=\"\",\"\",'6'!$M$49)","v":""},null,{"$f":"IF('6'!$O$49=\"\",\"\",'6'!$O$49)","v":""}]
["-",{"$f":"IF(D9=\"\",\"\",7)","v":""},{"$f":"IF('7'!$M$5=\"\",\"\",'7'!$M$5)","v":""},{"$f":"IF('7'!$M$4=\"\",\"\",'7'!$M$4)","v":""},{"$f":"IF('7'!$M$5=\"\",\"\",'7'!$M$5)","v":""},{"$f":"IF('7'!$M$6=\"\",\"\",'7'!$M$6)","v":""},{"$f":"IF('7'!$C$6=\"\",\"\",'7'!$C$6)","v":""},{"$f":"IF('7'!$O$45=0,\"\",'7'!$O$45)","v":""},{"$f":"IF('7'!$O$46=0,\"\",'7'!$O$46)","v":""},{"$f":"IF('7'!$J$27=0,\"\",'7'!$J$27)","v":""},{"$f":"IF('7'!$J$28=0,\"\",'7'!$J$28)","v":""},{"$f":"IF('7'!$J$29=0,\"\",'7'!$J$29)","v":""},{"$f":"IF(D9=\"\",\"\",IF($N9=\"X\",('7'!$O$47*-1),'7'!$O$47))","v":""},"",{"$f":"IF(D9=\"\",\"\",'7'!$M$49)","v":""},null,{"$f":"IF('7'!$O$49=\"\",\"\",'7'!$O$49)","v":""}]
["-",{"$f":"IF(D10=\"\",\"\",8)","v":""},{"$f":"IF('8'!$M$5=\"\",\"\",'8'!$M$5)","v":""},{"$f":"IF('8'!$M$4=\"\",\"\",'8'!$M$4)","v":""},{"$f":"IF('8'!$M$5=\"\",\"\",'8'!$M$5)","v":""},{"$f":"IF('8'!$M$6=\"\",\"\",'8'!$M$6)","v":""},{"$f":"IF('8'!$C$6=\"\",\"\",'8'!$C$6)","v":""},{"$f":"IF('8'!$O$45=0,\"\",'8'!$O$45)","v":""},{"$f":"IF('8'!$O$46=0,\"\",'8'!$O$46)","v":""},{"$f":"IF('8'!$J$27=0,\"\",'8'!$J$27)","v":""},{"$f":"IF('8'!$J$28=0,\"\",'8'!$J$28)","v":""},{"$f":"IF('8'!$J$29=0,\"\",'8'!$J$29)","v":""},{"$f":"IF(D10=\"\",\"\",IF($N10=\"X\",('8'!$O$47*-1),'8'!$O$47))","v":""},"",{"$f":"IF(D10=\"\",\"\",'8'!$M$49)","v":""},null,{"$f":"IF('8'!$O$49=\"\",\"\",'8'!$O$49)","v":""}]
["-",{"$f":"IF(D11=\"\",\"\",9)","v":""},{"$f":"IF('9'!$M$5=\"\",\"\",'9'!$M$5)","v":""},{"$f":"IF('9'!$M$4=\"\",\"\",'9'!$M$4)","v":""},{"$f":"IF('9'!$M$5=\"\",\"\",'9'!$M$5)","v":""},{"$f":"IF('9'!$M$6=\"\",\"\",'9'!$M$6)","v":""},{"$f":"IF('9'!$C$6=\"\",\"\",'9'!$C$6)","v":""},{"$f":"IF('9'!$O$45=0,\"\",'9'!$O$45)","v":""},{"$f":"IF('9'!$O$46=0,\"\",'9'!$O$46)","v":""},{"$f":"IF('9'!$J$27=0,\"\",'9'!$J$27)","v":""},{"$f":"IF('9'!$J$28=0,\"\",'9'!$J$28)","v":""},{"$f":"IF('9'!$J$29=0,\"\",'9'!$J$29)","v":""},{"$f":"IF(D11=\"\",\"\",IF($N11=\"X\",('9'!$O$47*-1),'9'!$O$47))","v":""},"",{"$f":"IF(D11=\"\",\"\",'9'!$M$49)","v":""},null,{"$f":"IF('9'!$O$49=\"\",\"\",'9'!$O$49)","v":""}]
["-",{"$f":"IF(D12=\"\",\"\",10)","v":""},{"$f":"IF('10'!$M$5=\"\",\"\",'10'!$M$5)","v":""},{"$f":"IF('10'!$M$4=\"\",\"\",'10'!$M$4)","v":""},{"$f":"IF('10'!$M$5=\"\",\"\",'10'!$M$5)","v":""},{"$f":"IF('10'!$M$6=\"\",\"\",'10'!$M$6)","v":""},{"$f":"IF('10'!$C$6=\"\",\"\",'10'!$C$6)","v":""},{"$f":"IF('10'!$O$45=0,\"\",'10'!$O$45)","v":""},{"$f":"IF('10'!$O$46=0,\"\",'10'!$O$46)","v":""},{"$f":"IF('10'!$J$27=0,\"\",'10'!$J$27)","v":""},{"$f":"IF('10'!$J$28=0,\"\",'10'!$J$28)","v":""},{"$f":"IF('10'!$J$29=0,\"\",'10'!$J$29)","v":""},{"$f":"IF(D12=\"\",\"\",IF($N12=\"X\",('10'!$O$47*-1),'10'!$O$47))","v":""},"",{"$f":"IF(D12=\"\",\"\",'10'!$M$49)","v":""},null,{"$f":"IF('10'!$O$49=\"\",\"\",'10'!$O$49)","v":""}]
["-",{"$f":"IF(D13=\"\",\"\",1)","v":""},{"$f":"IF('1'!$M$5=\"\",\"\",'1'!$M$5)","v":""},{"$f":"IF('1'!$M$4=\"\",\"\",'1'!$M$4)","v":""},{"$f":"IF('1'!$M$5=\"\",\"\",'1'!$M$5)","v":""},{"$f":"IF('1'!$M$6=\"\",\"\",'1'!$M$6)","v":""},{"$f":"IF('1'!$C$6=\"\",\"\",'1'!$C$6)","v":""},{"$f":"IF('1'!$O$45=0,\"\",'1'!$O$45)","v":""},{"$f":"IF('1'!$O$46=0,\"\",'1'!$O$46)","v":""},{"$f":"IF('1'!$J$27=0,\"\",'1'!$J$27)","v":""},{"$f":"IF('1'!$J$28=0,\"\",'1'!$J$28)","v":""},{"$f":"IF('1'!$J$29=0,\"\",'1'!$J$29)","v":""},{"$f":"IF(D13=\"\",\"\",IF($N13=\"X\",('1'!$O$47*-1),'1'!$O$47))","v":""},"",{"$f":"IF(D13=\"\",\"\",'1'!$M$49)","v":""},null,{"$f":"IF('1'!$O$49=\"\",\"\",'1'!$O$49)","v":""}]
["-",{"$f":"IF(D14=\"\",\"\",11)","v":""},{"$f":"IF('11'!$M$5=\"\",\"\",'11'!$M$5)","v":""},{"$f":"IF('11'!$M$4=\"\",\"\",'11'!$M$4)","v":""},{"$f":"IF('11'!$M$5=\"\",\"\",'11'!$M$5)","v":""},{"$f":"IF('11'!$M$6=\"\",\"\",'11'!$M$6)","v":""},{"$f":"IF('11'!$C$6=\"\",\"\",'11'!$C$6)","v":""},{"$f":"IF('11'!$O$45=0,\"\",'11'!$O$45)","v":""},{"$f":"IF('11'!$O$46=0,\"\",'11'!$O$46)","v":""},{"$f":"IF('11'!$J$27=0,\"\",'11'!$J$27)","v":""},{"$f":"IF('11'!$J$28=0,\"\",'11'!$J$28)","v":""},{"$f":"IF('11'!$J$29=0,\"\",'11'!$J$29)","v":""},{"$f":"IF(D14=\"\",\"\",IF($N14=\"X\",('11'!$O$47*-1),'11'!$O$47))","v":""},"",{"$f":"IF(D14=\"\",\"\",'11'!$M$49)","v":""},null,{"$f":"IF('11'!$O$49=\"\",\"\",'11'!$O$49)","v":""}]
["-",{"$f":"IF(D15=\"\",\"\",12)","v":""},{"$f":"IF('12'!$M$5=\"\",\"\",'12'!$M$5)","v":""},{"$f":"IF('12'!$M$4=\"\",\"\",'12'!$M$4)","v":""},{"$f":"IF('12'!$M$5=\"\",\"\",'12'!$M$5)","v":""},{"$f":"IF('12'!$M$6=\"\",\"\",'12'!$M$6)","v":""},{"$f":"IF('12'!$C$6=\"\",\"\",'12'!$C$6)","v":""},{"$f":"IF('12'!$O$45=0,\"\",'12'!$O$45)","v":""},{"$f":"IF('12'!$O$46=0,\"\",'12'!$O$46)","v":""},{"$f":"IF('12'!$J$27=0,\"\",'12'!$J$27)","v":""},{"$f":"IF('12'!$J$28=0,\"\",'12'!$J$28)","v":""},{"$f":"IF('12'!$J$29=0,\"\",'12'!$J$29)","v":""},{"$f":"IF(D15=\"\",\"\",IF($N15=\"X\",('12'!$O$47*-1),'12'!$O$47))","v":""},"",{"$f":"IF(D15=\"\",\"\",'12'!$M$49)","v":""},null,{"$f":"IF('12'!$O$49=\"\",\"\",'12'!$O$49)","v":""}]
["-",{"$f":"IF(D16=\"\",\"\",13)","v":""},{"$f":"IF('13'!$M$5=\"\",\"\",'13'!$M$5)","v":""},{"$f":"IF('13'!$M$4=\"\",\"\",'13'!$M$4)","v":""},{"$f":"IF('13'!$M$5=\"\",\"\",'13'!$M$5)","v":""},{"$f":"IF('13'!$M$6=\"\",\"\",'13'!$M$6)","v":""},{"$f":"IF('13'!$C$6=\"\",\"\",'13'!$C$6)","v":""},{"$f":"IF('13'!$O$45=0,\"\",'13'!$O$45)","v":""},{"$f":"IF('13'!$O$46=0,\"\",'13'!$O$46)","v":""},{"$f":"IF('13'!$J$27=0,\"\",'13'!$J$27)","v":""},{"$f":"IF('13'!$J$28=0,\"\",'13'!$J$28)","v":""},{"$f":"IF('13'!$J$29=0,\"\",'13'!$J$29)","v":""},{"$f":"IF(D16=\"\",\"\",IF($N16=\"X\",('13'!$O$47*-1),'13'!$O$47))","v":""},"",{"$f":"IF(D16=\"\",\"\",'13'!$M$49)","v":""},null,{"$f":"IF('13'!$O$49=\"\",\"\",'13'!$O$49)","v":""}]
["-",{"$f":"IF(D17=\"\",\"\",14)","v":""},{"$f":"IF('14'!$M$5=\"\",\"\",'14'!$M$5)","v":""},{"$f":"IF('14'!$M$4=\"\",\"\",'14'!$M$4)","v":""},{"$f":"IF('14'!$M$5=\"\",\"\",'14'!$M$5)","v":""},{"$f":"IF('14'!$M$6=\"\",\"\",'14'!$M$6)","v":""},{"$f":"IF('14'!$C$6=\"\",\"\",'14'!$C$6)","v":""},{"$f":"IF('14'!$O$45=0,\"\",'14'!$O$45)","v":""},{"$f":"IF('14'!$O$46=0,\"\",'14'!$O$46)","v":""},{"$f":"IF('14'!$J$27=0,\"\",'14'!$J$27)","v":""},{"$f":"IF('14'!$J$28=0,\"\",'14'!$J$28)","v":""},{"$f":"IF('14'!$J$29=0,\"\",'14'!$J$29)","v":""},{"$f":"IF(D17=\"\",\"\",IF($N17=\"X\",('14'!$O$47*-1),'14'!$O$47))","v":""},"",{"$f":"IF(D17=\"\",\"\",'14'!$M$49)","v":""},null,{"$f":"IF('14'!$O$49=\"\",\"\",'14'!$O$49)","v":""}]
["-",{"$f":"IF(D18=\"\",\"\",15)","v":""},{"$f":"IF('15'!$M$5=\"\",\"\",'15'!$M$5)","v":""},{"$f":"IF('15'!$M$4=\"\",\"\",'15'!$M$4)","v":""},{"$f":"IF('14'!$M$5=\"\",\"\",'14'!$M$5)","v":""},{"$f":"IF('15'!$M$6=\"\",\"\",'15'!$M$6)","v":""},{"$f":"IF('15'!$C$6=\"\",\"\",'15'!$C$6)","v":""},{"$f":"IF('15'!$O$45=0,\"\",'15'!$O$45)","v":""},{"$f":"IF('15'!$O$46=0,\"\",'15'!$O$46)","v":""},{"$f":"IF('15'!$J$27=0,\"\",'15'!$J$27)","v":""},{"$f":"IF('15'!$J$28=0,\"\",'15'!$J$28)","v":""},{"$f":"IF('15'!$J$29=0,\"\",'15'!$J$29)","v":""},{"$f":"IF(D18=\"\",\"\",IF($N18=\"X\",('15'!$O$47*-1),'15'!$O$47))","v":""},"",{"$f":"IF(D18=\"\",\"\",'15'!$M$49)","v":""},null,{"$f":"IF('15'!$O$49=\"\",\"\",'15'!$O$49)","v":""}]
["-",{"$f":"IF(D19=\"\",\"\",2)","v":""},{"$f":"IF('2'!$M$5=\"\",\"\",'2'!$M$5)","v":""},{"$f":"IF('2'!$M$4=\"\",\"\",'2'!$M$4)","v":""},{"$f":"IF('2'!$M$5=\"\",\"\",'2'!$M$5)","v":""},{"$f":"IF('2'!$M$6=\"\",\"\",'2'!$M$6)","v":""},{"$f":"IF('2'!$C$6=\"\",\"\",'2'!$C$6)","v":""},{"$f":"IF('2'!$O$45=0,\"\",'2'!$O$45)","v":""},{"$f":"IF('2'!$O$46=0,\"\",'2'!$O$46)","v":""},{"$f":"IF('2'!$J$27=0,\"\",'2'!$J$27)","v":""},{"$f":"IF('2'!$J$28=0,\"\",'2'!$J$28)","v":""},{"$f":"IF('2'!$J$29=0,\"\",'2'!$J$29)","v":""},{"$f":"IF(D19=\"\",\"\",IF($N19=\"X\",('2'!$O$47*-1),'2'!$O$47))","v":""},"",{"$f":"IF(D19=\"\",\"\",'2'!$M$49)","v":""},null,{"$f":"IF('2'!$O$49=\"\",\"\",'2'!$O$49)","v":""}]
[]
[null,null,null,null,null,null,null,null,null,null,null,null,null,null,null,"B.Strand 15.07.2015"]

{"sheet":"1","index":2,"n_rows":53,"n_cols":16,"rows_kept":53,"cut":false,"hidden":false,"merged":[[51,0,51,9],[52,0,52,9],[48,12,48,13],[44,14,44,15],[45,14,45,15],[51,11,51,15],[49,11,49,15],[46,14,46,15],[44,1,44,4],[46,0,48,9],[49,0,49,9],[47,12,47,13],[46,11,46,13],[44,11,44,13],[45,11,45,13],[45,0,45,4],[43,14,43,15],[43,11,43,13],[43,1,43,4],[38,11,38,13],[26,1,26,4],[35,0,35,15],[37,11,37,13],[39,11,39,13],[40,11,40,13],[38,4,38,9],[39,4,39,9],[42,0,42,4],[34,0,34,4],[32,1,32,4],[33,1,33,4],[41,11,41,13],[23,0,23,4],[37,4,37,9],[27,10,27,15],[40,4,40,9],[36,11,36,13],[25,0,25,4],[41,0,41,3],[36,4,36,9],[27,1,27,4],[28,1,28,4],[31,0,31,4],[36,0,36,1],[36,2,36,3],[41,4,41,9],[0,5,0,15],[1,10,1,12],[1,2,1,5],[31,10,31,15],[30,0,30,15],[29,10,29,15],[5,12,5,15],[12,10,12,15],[3,10,3,11],[4,10,4,11],[3,0,3,1],[26,10,26,15],[14,1,14,4],[17,10,17,15],[17,1,17,4],[18,1,18,4],[3,2,3,9],[24,0,24,15],[11,0,11,15],[34,10,34,15],[33,10,33,15],[28,10,28,15],[25,10,25,15],[32,10,32,15],[15,10,15,15],[18,10,18,15],[23,10,23,15],[16,1,16,4],[16,10,16,15],[19,1,19,4],[19,10,19,15],[3,12,3,15],[13,10,13,15],[13,1,13,4],[5,2,5,9],[14,10,14,15],[15,1,15,4],[0,2,0,4],[1,0,1,1],[4,0,4,1],[5,0,5,1],[29,0,29,4],[2,0,2,15],[4,12,4,15],[22,1,22,4],[22,10,22,15],[20,1,20,4],[20,10,20,15],[21,1,21,4],[21,10,21,15],[5,10,5,11],[4,2,4,9],[12,0,12,4]]}
[null,null,null,null,null,"Kl. A - DOMMERPROTOKOLL"]
[{"$f":"Resultatskj!K2","v":"Dato:"},null,{"$f":"IF(Resultatskj!L2=\"\",\"\",Resultatskj!L2)","v":""},null,null,null,null,null,null,{"$f":"Resultatskj!G4","v":"Gruppe:"},{"$f":"IF(Resultatskj!H4=\"\",\"\",Resultatskj!H4)","v":"Spor"},null,null,null,"Katalog nr.",{"$f":"Resultatskj!B8","v":""}]
[10]
[{"$f":"Resultatskj!A2","v":"Arrangør:"},null,{"$f":"IF(Resultatskj!$C$2=\"\",\"\",Resultatskj!$C$2)","v":""},null,null,null,null,null,null,null,{"$f":"Resultatskj!C6","v":"Hundens navn:"}]
["Fører:",null,null,null,null,null,null,null,null,null,{"$f":"Resultatskj!D6","v":"Reg.nr.:"}]
[{"$f":"Resultatskj!F6","v":"Klubb:"},null,null,null,null,null,null,null,null,null,{"$f":"Resultatskj!E6","v":"Rase:"}]
[]
[]
[null,"Klasse:",null,"Liten",null,null,null,null,null,"Middels",null,null,"Stor"]
[]
[]
["Lydighet:"]
["Øvelser:",null,null,null,null,"Koeff.","Karakter","Karakter","Snitt","Poeng"]
[1,"Fri ved foten",null,null,null,3,null,null,{"$f":"IF(G14=\"\",\"\",IF(H14=\"\",\"\",(G14+H14)/2))","v":""},{"$f":"IF(I14=\"\",\"\",IF(I14=0,\"I.G.\",I14*F14))","v":""}]
[2,"Innkalling m/stå og dekk",null,null,null,3,null,null,{"$f":"IF(G15=\"\",\"\",IF(H15=\"\",\"\",(G15+H15)/2))","v":""},{"$f":"IF(I15=\"\",\"\",IF(I15=0,\"I.G.\",I15*F15))","v":""}]
[3,"Fremadsending",null,null,null,3,null,null,"",""]
[4,"Kryp",null,null,null,3,null,null,"",""]
[5,"Hals på kommando",null,null,null,2,null,null,"",""]
[6,"Apportering metallapport",null,null,null,3,null,null,"",""]
[7,"Apportering tung gjenstand",null,null,null,3,null,null,"",""]
[8,"Fritt hopp over hinder",null,null,null,2,null,null,"",""]
[9,"Stigeklatring",null,null,null,2,null,null,"",""]
[10,"Fellesdekk",null,null,null,2,null,null,"",""]
["Sum lydighet:",null,null,null,null,{"$f":"SUM(F14:F23)","v":26},null,null,null,{"$f":"SUM(J14:J23)","v":0}]
["Sporgruppen:"]
["Øvelser:",null,null,null,null,"Koeff.","Karakter","Karakter","Snitt","Poeng"]
[11,"Feltsøk",null,null,null,10,null,null,{"$f":"IF(G27=\"\",\"\",IF(H27=\"\",\"\",(G27+H27)/2))","v":""},{"$f":"IF(I27=\"\",\"\",IF(I27=0,\"I.G.\",I27*F27))","v":""}]
[12,"Sporoppsøk",null,null,null,5,null,null,{"$f":"IF(G28=\"\",\"\",IF(H28=\"\",\"\",(G28+H28)/2))","v":""},{"$f":"IF(I28=\"\",\"\",IF(I28=0,\"I.G.\",I28*F28))","v":""}]
[13,"Spor",null,null,null,24,null,null,"",""]
["Sum spesialøvelser:",null,null,null,null,{"$f":"SUM(F27:F29)","v":39},null,null,null,{"$f":"IF(AND(J27=\"\",J28=\"\",J29=\"\"),\"\",SUM(J27:J29))","v":""}]
["Runderingsgruppen:"]
[{"$f":"$A$13","v":"Øvelser:"},null,null,null,null,"Koeff.","Karakter","Karakter","Snitt","Poeng"]
[11,"Feltsøk",null,null,null,10,null,null,{"$f":"IF(G33=\"\",\"\",IF(H33=\"\",\"\",(G33+H33)/2))","v":""},{"$f":"IF(I33=\"\",\"\",IF(I33=0,\"I.G.\",I33*F33))","v":""}]
[12,"Rundering",null,null,null,29,null,null,{"$f":"IF(G34=\"\",\"\",IF(H34=\"\",\"\",(G34+H34)/2))","v":""},{"$f":"IF(I34=\"\",\"\",IF(I34=0,\"I.G.\",I34*F34))","v":""}]
["Sum spesialøvelser:",null,null,null,null,{"$f":"SUM(F33:F34)","v":39},null,null,null,{"$f":"IF(AND(J33=\"\",J34=\"\"),\"\",SUM(J33:J34))","v":""}]
["Rapportgruppen:",null,null,null,null,null,null,null,null,null,null,"Godkjent",null,null,300,"poeng"]
["Start kl.:",null,"Ankomst kl.:",null,"Anvendt tid:",null,null,null,null,null,null,"Godkjent",null,null,325,"poeng"]
["B","00:00:00","A","00:00:00",{"$f":"SUM(B38,D38)","v":"00:00:00"},null,null,null,null,null,null,"- Derav i spesialøvelsene",null,null,195,"poeng"]
["A","00:00:00","B","00:00:00",{"$f":"SUM(B39,D39)","v":"00:00:00"},null,null,null,null,null,null,"- Derav i lydighetsøvelsene",null,null,130,"poeng"]
["C","00:00:00","A","00:00:00",{"$f":"SUM(B40,D40)","v":"00:00:00"},null,null,null,null,null,null,"Cert/CACIT",null,null,575,"poeng"]
["A","00:00:00","D","00:00:00",{"$f":"SUM(B41,D41)","v":"00:00:00"},null,null,null,null,null,null,"- Derav i spesialøvelsene",null,null,312,"poeng"]
["Anvendt tid totalt:",null,null,null,{"$f":"SUM(E38:J41)","v":"00:00:00"},null,null,null,null,null,null,"- Derav i lydighetsøvelsene",null,null,208,"poeng"]
["Øvelser:",null,null,null,null,"Koeff.","Karakter","Karakter","Snitt","Poeng"]
[11,"Feltsøk",null,null,null,10,null,null,{"$f":"IF(G44=\"\",\"\",IF(H44=\"\",\"\",(G44+H44)/2))","v":""},{"$f":"IF(I44=\"\",\"\",IF(I44=0,\"I.G.\",I44*F44))","v":""},null,null,null,null,"Poeng"]
[12,"Rapport",null,null,null,29,null,null,{"$f":"IF(G45=\"\",\"\",IF(H45=\"\",\"\",(G45+H45)/2))","v":""},{"$f":"IF(I45=\"\",\"\",IF(I45=0,\"I.G.\",I45*F45))","v":""},null,"Sum Lydighet",null,null,{"$f":"J24","v":0}]
["Sum spesialøvelser:",null,null,null,null,{"$f":"SUM(F44:F45)","v":39},null,null,null,{"$f":"IF(AND(J44=\"\",J45=\"\"),\"\",SUM(J44:J45))","v":""},null,"Sum Spesialøvelser",null,null,{"$f":"IF(Resultatskj!H4=\"Rundering\",J35,IF(Resultatskj!H4=\"Spor\",J30,IF(Resultatskj!H4=\"Rapport\",J46,\"\")))","v":""}]
[null,null,null,null,null,null,null,null,null,null,null,"Totalpoeng",null,null,{"$f":"IF(O45=0,\"\",SUM(O45:P46))","v":""}]
[null,null,null,null,null,null,null,null,null,null,null,"Ikke godkj.","Godkj.",null,"Cert","Plass"]
[null,null,null,null,null,null,null,null,null,null,null,{"$f":"IF(OR(O47<O37,O46<O38,O45<O39,O47=\"\"),\"X\",\"\")","v":"X"},{"$f":"IF(AND(O47>=O37,O46>=O38,O45>=O39,L49=\"\"),\"X\",\"\")","v":""},null,{"$f":"IF(AND(O47>=575,O46>=311.99,O45>207.99,L49=\"\"),\"X\",\"\")","v":""},{"$f":"Resultatskj!A8","v":"-"}]
["Underskrift dommere",null,null,null,null,null,null,null,null,null,null,"Original til NKK. Kopi til NBF, arrangørklubben og deltaker."]
[]
[{"$f":"IF(Resultatskj!$C$3=\"\",\"\",Resultatskj!$C$3)","v":""},null,null,null,null,null,null,null,null,null,null,{"$f":"Resultatskj!K26","v":"B.Strand/A.Bakken 15.07.2015/19.06.2018"}]
[{"$f":"IF(Resultatskj!$C$4=\"\",\"\",Resultatskj!$C$4)","v":""}]

{"sheet":"2","index":3,"n_rows":53,"n_cols":16,"rows_kept":53,"cut":false,"hidden":false,"merged":[[52,0,52,9],[12,0,12,4],[3,12,3,15],[16,10,16,15],[12,10,12,15],[13,10,13,15],[14,10,14,15],[15,10,15,15],[11,0,11,15],[16,1,16,4],[4,10,4,11],[13,1,13,4],[14,1,14,4],[15,1,15,4],[5,0,5,1],[5,2,5,9],[5,10,5,11],[29,0,29,4],[29,10,29,15],[21,1,21,4],[25,10,25,15],[26,10,26,15],[25,0,25,4],[28,1,28,4],[27,1,27,4],[24,0,24,15],[26,1,26,4],[27,10,27,15],[28,10,28,15],[5,12,5,15],[20,10,20,15],[17,1,17,4],[35,0,35,15],[36,0,36,1],[36,2,36,3],[42,0,42,4],[43,1,43,4],[36,4,36,9],[37,4,37,9],[38,4,38,9],[36,11,36,13],[43,14,43,15],[41,11,41,13],[40,11,40,13],[40,4,40,9],[39,4,39,9],[37,11,37,13],[38,11,38,13],[30,0,30,15],[31,0,31,4],[33,1,33,4],[34,0,34,4],[34,10,34,15],[32,1,32,4],[33,10,33,15],[32,10,32,15],[31,10,31,15],[20,1,20,4],[17,10,17,15],[18,1,18,4],[19,1,19,4],[18,10,18,15],[19,10,19,15],[22,1,22,4],[23,0,23,4],[23,10,23,15],[22,10,22,15],[21,10,21,15],[0,5,0,15],[1,0,1,1],[1,2,1,5],[1,10,1,12],[0,2,0,4],[2,0,2,15],[3,0,3,1],[3,2,3,9],[3,10,3,11],[4,12,4,15],[4,0,4,1],[4,2,4,9],[39,11,39,13],[44,11,44,13],[43,11,43,13],[44,14,44,15],[44,1,44,4],[51,11,51,15],[49,0,49,9],[49,11,49,15],[51,0,51,9],[41,0,41,3],[41,4,41,9],[45,14,45,15],[45,11,45,13],[45,0,45,4],[46,11,46,13],[46,14,46,15],[46,0,48,9],[47,12,47,13],[48,12,48,13]]}
[null,null,null,null,null,{"$f":"'1'!F1:R1","v":"Kl. A - DOMMERPROTOKOLL"}]
[{"$f":"'1'!A2:B2","v":"Dato:"},null,{"$f":"IF(Resultatskj!L2=\"\",\"\",Resultatskj!L2)","v":""},null,null,null,null,null,null,{"$f":"'1'!J2","v":"Gruppe:"},{"$f":"IF(Resultatskj!H4=\"\",\"\",Resultatskj!H4)","v":"Spor"},null,null,null,"Katalog nr.",{"$f":"Resultatskj!B9","v":""}]
[10]
[{"$f":"'1'!A4:B4","v":"Arrangør:"},null,{"$f":"IF(Resultatskj!$C$2=\"\",\"\",Resultatskj!$C$2)","v":""},null,null,null,null,null,null,null,{"$f":"'1'!K4:L4","v":"Hundens navn:"}]
[{"$f":"'1'!A5:B5","v":"Fører:"},null,null,null,null,null,null,null,null,null,{"$f":"'1'!K5:L5","v":"Reg.nr.:"}]
[{"$f":"'1'!A6:B6","v":"Klubb:"},null,null,null,null,null,null,null,null,null,{"$f":"'1'!K6:L6","v":"Rase:"}]
[]
[]
[null,"Klasse",null,"Liten",null,null,null,null,null,"Middels",null,null,"Stor"]
[]
[]
[{"$f":"'1'!A12","v":"Lydighet:"}]
[{"$f":"'1'!A13","v":"Øvelser:"},null,null,null,null,"Koeff.","Karakter","Karakter","Snitt","Poeng"]
[{"$f":"'1'!A14","v":1},{"$f":"'1'!B14","v":"Fri ved foten"},null,null,null,3,null,null,{"$f":"IF(G14=\"\",\"\",IF(H14=\"\",\"\",(G14+H14)/2))","v":""},{"$f":"IF(I14=\"\",\"\",IF(I14=0,\"I.G.\",I14*F14))","v":""}]
[{"$f":"'1'!A15","v":2},{"$f":"'1'!B15","v":"Innkalling m/stå og dekk"},null,null,null,3,null,null,{"$f":"IF(G15=\"\",\"\",IF(H15=\"\",\"\",(G15+H15)/2))","v":""},{"$f":"IF(I15=\"\",\"\",IF(I15=0,\"I.G.\",I15*F15))","v":""}]
[{"$f":"'1'!A16","v":3},{"$f":"'1'!B16","v":"Fremadsending"},null,null,null,3,null,null,"",""]
[{"$f":"'1'!A17","v":4},{"$f":"'1'!B17","v":"Kryp"},null,null,null,3,null,null,"",""]
[{"$f":"'1'!A18","v":5},{"$f":"'1'!B18","v":"Hals på kommando"},null,null,null,2,null,null,"",""]
[{"$f":"'1'!A19","v":6},{"$f":"'1'!B19","v":"Apportering metallapport"},null,null,null,3,null,null,"",""]
[{"$f":"'1'!A20","v":7},{"$f":"'1'!B20","v":"Apportering tung gjenstand"},null,null,null,3,null,null,"",""]
[{"$f":"'1'!A21","v":8},"Fritt hopp over hinder",null,null,null,2,null,null,"",""]
[{"$f":"'1'!A22","v":9},{"$f":"'1'!B22","v":"Stigeklatring"},null,null,null,2,null,null,"",""]
[{"$f":"'1'!A23","v":10},{"$f":"'1'!B23","v":"Fellesdekk"},null,null,null,2,null,null,"",""]
[{"$f":"'1'!A24","v":"Sum lydighet:"},null,null,null,null,{"$f":"SUM(F14:F23)","v":26},null,null,null,{"$f":"SUM(J14:J23)","v":0}]
[{"$f":"'1'!A25","v":"Sporgruppen:"}]
[{"$f":"'1'!A26","v":"Øvelser:"},null,null,null,null,"Koeff.","Karakter","Karakter","Snitt","Poeng"]
[{"$f":"'1'!A27","v":11},{"$f":"'1'!B27","v":"Feltsøk"},null,null,null,10,null,null,{"$f":"IF(G27=\"\",\"\",IF(H27=\"\",\"\",(G27+H27)/2))","v":""},{"$f":"IF(I27=\"\",\"\",IF(I27=0,\"I.G.\",I27*F27))","v":""}]
[{"$f":"'1'!A28","v":12},{"$f":"'1'!B28","v":"Sporoppsøk"},null,null,null,5,null,null,{"$f":"IF(G28=\"\",\"\",IF(H28=\"\",\"\",(G28+H28)/2))","v":""},{"$f":"IF(I28=\"\",\"\",IF(I28=0,\"I.G.\",I28*F28))","v":""}]
[{"$f":"'1'!A29","v":13},{"$f":"'1'!B29","v":"Spor"},null,null,null,24,null,null,"",""]
[{"$f":"'1'!A30","v":"Sum spesialøvelser:"},null,null,null,null,{"$f":"SUM(F27:F29)","v":39},null,null,null,{"$f":"IF(AND(J27=\"\",J28=\"\",J29=\"\"),\"\",SUM(J27:J29))","v":""}]
[{"$f":"'1'!A31","v":"Runderingsgruppen:"}]
[{"$f":"'1'!A32","v":"Øvelser:"},null,null,null,null,"Koeff.","Karakter","Karakter","Snitt","Poeng"]
[{"$f":"'1'!A33","v":11},{"$f":"'1'!B33","v":"Feltsøk"},null,null,null,10,null,null,{"$f":"IF(G33=\"\",\"\",IF(H33=\"\",\"\",(G33+H33)/2))","v":""},{"$f":"IF(I33=\"\",\"\",IF(I33=0,\"I.G.\",I33*F33))","v":""}]
[{"$f":"'1'!A34","v":12},{"$f":"'1'!B34","v":"Rundering"},null,null,null,{"$f":"'1'!F34","v":29},null,null,{"$f":"IF(G34=\"\",\"\",IF(H34=\"\",\"\",(G34+H34)/2))","v":""},{"$f":"IF(I34=\"\",\"\",IF(I34=0,\"I.G.\",I34*F34))","v":""}]
[{"$f":"'1'!A35","v":"Sum spesialøvelser:"},null,null,null,null,{"$f":"SUM(F33:F34)","v":39},null,null,null,{"$f":"IF(AND(J33=\"\",J34=\"\"),\"\",SUM(J33:J34))","v":""},null,"Godkjent",null,null,300,"poeng"]
[{"$f":"'1'!A36","v":"Rapportgruppen:"}]
[{"$f":"'1'!A37","v":"Start kl.:"},0,{"$f":"'1'!C37","v":"Ankomst kl.:"},0,{"$f":"'1'!E37:J37","v":"Anvendt tid:"},null,null,null,null,null,null,{"$f":"'1'!L37:N37","v":"Godkjent"},null,null,{"$f":"'1'!O37","v":325},{"$f":"'1'!P37","v":"poeng"}]
[{"$f":"'1'!A38","v":"B"},"00:00:00",{"$f":"'1'!C38","v":"A"},"00:00:00",{"$f":"SUM(B38,D38)","v":"00:00:00"},null,null,null,null,null,null,{"$f":"'1'!L38:N38","v":"- Derav i spesialøvelsene"},null,null,195,{"$f":"'1'!P38","v":"poeng"}]
[{"$f":"'1'!A39","v":"A"},"00:00:00",{"$f":"'1'!C39","v":"B"},"00:00:00",{"$f":"SUM(B39,D39)","v":"00:00:00"},null,null,null,null,null,null,"- Derav i lydighetsøvelsene",null,null,130,{"$f":"'1'!P39","v":"poeng"}]
[{"$f":"'1'!A40","v":"C"},"00:00:00",{"$f":"'1'!C40","v":"A"},"00:00:00",{"$f":"SUM(B40,D40)","v":"00:00:00"},null,null,null,null,null,null,{"$f":"'1'!L40:N40","v":"Cert/CACIT"},null,null,575,{"$f":"'1'!P40","v":"poeng"}]
[{"$f":"'1'!A41","v":"A"},"00:00:00",{"$f":"'1'!C41","v":"D"},"00:00:00",{"$f":"SUM(E37:J40)","v":"00:00:00"},null,null,null,null,null,null,{"$f":"'1'!L41:N41","v":"- Derav i spesialøvelsene"},null,null,312,{"$f":"'1'!P41","v":"poeng"}]
[{"$f":"'1'!A42","v":"Anvendt tid totalt:"},null,null,null,{"$f":"SUM(E38:J41)","v":"00:00:00"},null,null,null,null,null,null,{"$f":"'1'!L42:N42","v":"- Derav i lydighetsøvelsene"},null,null,208,{"$f":"'1'!P42","v":"poeng"}]
[{"$f":"'1'!A43","v":"Øvelser:"},null,null,null,null,{"$f":"'1'!F43","v":"Koeff."},{"$f":"'1'!G43","v":"Karakter"},{"$f":"'1'!H43","v":"Karakter"},"Snitt",{"$f":"'1'!J43","v":"Poeng"}]
[{"$f":"'1'!A44","v":11},{"$f":"'1'!B44","v":"Feltsøk"},null,null,null,10,null,null,{"$f":"IF(G44=\"\",\"\",IF(H44=\"\",\"\",(G44+H44)/2))","v":""},{"$f":"IF(I44=\"\",\"\",IF(I44=0,\"I.G.\",I44*F44))","v":""},null,null,null,null,{"$f":"'1'!O44:P44","v":"Poeng"}]
[{"$f":"'1'!A45","v":12},{"$f":"'1'!B45","v":"Rapport"},null,null,null,{"$f":"'1'!F45","v":29},null,null,{"$f":"IF(G45=\"\",\"\",IF(H45=\"\",\"\",(G45+H45)/2))","v":""},{"$f":"IF(I45=\"\",\"\",IF(I45=0,\"I.G.\",I45*F45))","v":""},null,{"$f":"'1'!L45:N45","v":"Sum Lydighet"},null,null,{"$f":"J24","v":0}]
[{"$f":"'1'!A46","v":"Sum spesialøvelser:"},null,null,null,null,{"$f":"SUM(F44:F45)","v":39},null,null,null,null,null,{"$f":"'1'!L46:N46","v":"Sum Spesialøvelser"},null,null,{"$f":"IF(Resultatskj!H4=\"Rundering\",J35,IF(Resultatskj!H4=\"Spor\",J30,IF(Resultatskj!H4=\"Rapport\",J46,\"\")))","v":""}]
[null,null,null,null,null,null,null,null,null,null,null,{"$f":"'1'!L47:N47","v":"Totalpoeng"},null,null,{"$f":"SUM(O45:P46)","v":0}]
[null,null,null,null,null,null,null,null,null,null,null,{"$f":"'1'!L48","v":"Ikke godkj."},{"$f":"'1'!M48","v":"Godkj."},null,{"$f":"'1'!O48","v":"Cert"},{"$f":"'1'!P48","v":"Plass"}]
[{"$f":"IF(Resultatskj!C3=\"\",\"\",Resultatskj!C3)","v":""},null,null,null,null,{"$f":"IF(Resultatskj!C4=\"\",\"\",Resultatskj!C4)","v":""},null,null,null,null,null,{"$f":"IF(OR(O47<O37,O46<O38,O45<O39,O47=\"\"),\"X\",\"\")","v":"X"},{"$f":"IF(AND(O47>=O37,O46>=O38,O45>=O39,L49=\"\"),\"X\",\"\")","v":""},null,{"$f":"IF(AND(O47>=575,O46>=311.99,O45>207.99,L49=\"\"),\"X\",\"\")","v":""},{"$f":"Resultatskj!A9","v":"-"}]
["Underskrift dommere",null,null,null,null,null,null,null,null,null,null,{"$f":"Resultatskj!K26","v":"B.Strand/A.Bakken 15.07.2015/19.06.2018"}]
[]
[{"$f":"IF(Resultatskj!$C$3=\"\",\"\",Resultatskj!$C$3)","v":""}]
[{"$f":"IF(Resultatskj!$C$4=\"\",\"\",Resultatskj!$C$4)","v":""}]

{"sheet":"3","index":4,"n_rows":53,"n_cols":16,"rows_kept":53,"cut":false,"hidden":false,"merged":[[45,11,45,13],[38,4,38,9],[40,11,40,13],[39,11,39,13],[39,4,39,9],[43,11,43,13],[41,11,41,13],[43,1,43,4],[29,10,29,15],[30,0,30,15],[31,0,31,4],[33,1,33,4],[31,10,31,15],[32,10,32,15],[32,1,32,4],[51,0,51,9],[52,0,52,9],[28,1,28,4],[29,0,29,4],[23,0,23,4],[36,4,36,9],[49,0,49,9],[37,4,37,9],[42,0,42,4],[44,1,44,4],[45,0,45,4],[36,2,36,3],[41,0,41,3],[41,4,41,9],[40,4,40,9],[23,10,23,15],[34,10,34,15],[35,0,35,15],[0,5,0,15],[28,10,28,15],[3,2,3,9],[33,10,33,15],[3,12,3,15],[16,10,16,15],[11,0,11,15],[16,1,16,4],[3,0,3,1],[20,1,20,4],[21,1,21,4],[24,0,24,15],[34,0,34,4],[37,11,37,13],[38,11,38,13],[4,0,4,1],[4,2,4,9],[1,0,1,1],[1,2,1,5],[1,10,1,12],[2,0,2,15],[4,10,4,11],[4,12,4,15],[3,10,3,11],[5,0,5,1],[5,2,5,9],[5,10,5,11],[22,1,22,4],[20,10,20,15],[21,10,21,15],[22,10,22,15],[12,0,12,4],[12,10,12,15],[13,1,13,4],[13,10,13,15],[19,1,19,4],[17,1,17,4],[18,10,18,15],[17,10,17,15],[19,10,19,15],[15,1,15,4],[15,10,15,15],[14,10,14,15],[18,1,18,4],[26,1,26,4],[27,1,27,4],[27,10,27,15],[25,10,25,15],[26,10,26,15],[25,0,25,4],[36,11,36,13],[0,2,0,4],[46,0,48,9],[51,11,51,15],[49,11,49,15],[46,11,46,13],[46,14,46,15],[47,12,47,13],[48,12,48,13],[45,14,45,15],[43,14,43,15],[44,11,44,13],[44,14,44,15],[36,0,36,1],[5,12,5,15],[14,1,14,4]]}
[null,null,null,null,null,{"$f":"'1'!F1:R1","v":"Kl. A - DOMMERPROTOKOLL"}]
[{"$f":"'1'!A2:B2","v":"Dato:"},null,{"$f":"IF(Resultatskj!L2=\"\",\"\",Resultatskj!L2)","v":""},null,null,null,null,null,null,{"$f":"'1'!J2","v":"Gruppe:"},{"$f":"IF(Resultatskj!H4=\"\",\"\",Resultatskj!H4)","v":"Spor"},null,null,null,"Katalog nr.",{"$f":"Resultatskj!B10","v":""}]
[10]
[{"$f":"'1'!A4:B4","v":"Arrangør:"},null,{"$f":"IF(Resultatskj!$C$2=\"\",\"\",Resultatskj!$C$2)","v":""},null,null,null,null,null,null,null,{"$f":"'1'!K4:L4","v":"Hundens navn:"}]
[{"$f":"'1'!A5:B5","v":"Fører:"},null,null,null,null,null,null,null,null,null,{"$f":"'1'!K5:L5","v":"Reg.nr.:"}]
[{"$f":"'1'!A6:B6","v":"Klubb:"},null,null,null,null,null,null,null,null,null,{"$f":"'1'!K6:L6","v":"Rase:"}]
[]
[]
[null,"Klasse",null,"Liten",null,null,null,null,null,"Middels",null,null,"Stor"]
[]
[]
[{"$f":"'1'!A12","v":"Lydighet:"}]
[{"$f":"'1'!A13","v":"Øvelser:"},null,null,null,null,"Koeff.","Karakter","Karakter","Snitt","Poeng"]
[{"$f":"'1'!A14","v":1},{"$f":"'1'!B14","v":"Fri ved foten"},null,null,null,3,null,null,{"$f":"IF(G14=\"\",\"\",IF(H14=\"\",\"\",(G14+H14)/2))","v":""},{"$f":"IF(I14=\"\",\"\",IF(I14=0,\"I.G.\",I14*F14))","v":""}]
[{"$f":"'1'!A15","v":2},{"$f":"'1'!B15","v":"Innkalling m/stå og dekk"},null,null,null,3,null,null,{"$f":"IF(G15=\"\",\"\",IF(H15=\"\",\"\",(G15+H15)/2))","v":""},{"$f":"IF(I15=\"\",\"\",IF(I15=0,\"I.G.\",I15*F15))","v":""}]
[{"$f":"'1'!A16","v":3},{"$f":"'1'!B16","v":"Fremadsending"},null,null,null,3,null,null,"",""]
[{"$f":"'1'!A17","v":4},{"$f":"'1'!B17","v":"Kryp"},null,null,null,3,null,null,"",""]
[{"$f":"'1'!A18","v":5},{"$f":"'1'!B18","v":"Hals på kommando"},null,null,null,2,null,null,"",""]
[{"$f":"'1'!A19","v":6},{"$f":"'1'!B19","v":"Apportering metallapport"},null,null,null,3,null,null,"",""]
[{"$f":"'1'!A20","v":7},{"$f":"'1'!B20","v":"Apportering tung gjenstand"},null,null,null,3,null,null,"",""]
[{"$f":"'1'!A21","v":8},"Fritt hopp over hinder",null,null,null,2,null,null,"",""]
[{"$f":"'1'!A22","v":9},{"$f":"'1'!B22","v":"Stigeklatring"},null,null,null,2,null,null,"",""]
[{"$f":"'1'!A23","v":10},{"$f":"'1'!B23","v":"Fellesdekk"},null,null,null,2,null,null,"",""]
[{"$f":"'1'!A24","v":"Sum lydighet:"},null,null,null,null,{"$f":"SUM(F14:F23)","v":26},null,null,null,{"$f":"SUM(J14:J23)","v":0}]
[{"$f":"'1'!A25","v":"Sporgruppen:"}]
[{"$f":"'1'!A26","v":"Øvelser:"},null,null,null,null,"Koeff.","Karakter","Karakter","Snitt","Poeng"]
[{"$f":"'1'!A27","v":11},{"$f":"'1'!B27","v":"Feltsøk"},null,null,null,10,null,null,{"$f":"IF(G27=\"\",\"\",IF(H27=\"\",\"\",(G27+H27)/2))","v":""},{"$f":"IF(I27=\"\",\"\",IF(I27=0,\"I.G.\",I27*F27))","v":""}]
[{"$f":"'1'!A28","v":12},{"$f":"'1'!B28","v":"Sporoppsøk"},null,null,null,5,null,null,{"$f":"IF(G28=\"\",\"\",IF(H28=\"\",\"\",(G28+H28)/2))","v":""},{"$f":"IF(I28=\"\",\"\",IF(I28=0,\"I.G.\",I28*F28))","v":""}]
[{"$f":"'1'!A29","v":13},{"$f":"'1'!B29","v":"Spor"},null,null,null,24,null,null,"",""]
[{"$f":"'1'!A30","v":"Sum spesialøvelser:"},null,null,null,null,{"$f":"SUM(F27:F29)","v":39},null,null,null,{"$f":"IF(AND(J27=\"\",J28=\"\",J29=\"\"),\"\",SUM(J27:J29))","v":""}]
[{"$f":"'1'!A31","v":"Runderingsgruppen:"}]
[{"$f":"'1'!A32","v":"Øvelser:"},null,null,null,null,"Koeff.","Karakter","Karakter","Snitt","Poeng"]
[{"$f":"'1'!A33","v":11},{"$f":"'1'!B33","v":"Feltsøk"},null,null,null,10,null,null,{"$f":"IF(G33=\"\",\"\",IF(H33=\"\",\"\",(G33+H33)/2))","v":""},{"$f":"IF(I33=\"\",\"\",IF(I33=0,\"I.G.\",I33*F33))","v":""}]
[{"$f":"'1'!A34","v":12},{"$f":"'1'!B34","v":"Rundering"},null,null,null,{"$f":"'1'!F34","v":29},null,null,{"$f":"IF(G34=\"\",\"\",IF(H34=\"\",\"\",(G34+H34)/2))","v":""},{"$f":"IF(I34=\"\",\"\",IF(I34=0,\"I.G.\",I34*F34))","v":""}]
[{"$f":"'1'!A35","v":"Sum spesialøvelser:"},null,null,null,null,{"$f":"SUM(F33:F34)","v":39},null,null,null,{"$f":"IF(AND(J33=\"\",J34=\"\"),\"\",SUM(J33:J34))","v":""},null,"Godkjent",null,null,300,"poeng"]
[{"$f":"'1'!A36","v":"Rapportgruppen:"}]
[{"$f":"'1'!A37","v":"Start kl.:"},0,{"$f":"'1'!C37","v":"Ankomst kl.:"},0,{"$f":"'1'!E37:J37","v":"Anvendt tid:"},null,null,null,null,null,null,{"$f":"'1'!L37:N37","v":"Godkjent"},null,null,{"$f":"'1'!O37","v":325},{"$f":"'1'!P37","v":"poeng"}]
[{"$f":"'1'!A38","v":"B"},"00:00:00",{"$f":"'1'!C38","v":"A"},"00:00:00",{"$f":"SUM(B38,D38)","v":"00:00:00"},null,null,null,null,null,null,{"$f":"'1'!L38:N38","v":"- Derav i spesialøvelsene"},null,null,195,{"$f":"'1'!P38","v":"poeng"}]
[{"$f":"'1'!A39","v":"A"},"00:00:00",{"$f":"'1'!C39","v":"B"},"00:00:00",{"$f":"SUM(B39,D39)","v":"00:00:00"},null,null,null,null,null,null,"- Derav i lydighetsøvelsene",null,null,130,{"$f":"'1'!P39","v":"poeng"}]
[{"$f":"'1'!A40","v":"C"},"00:00:00",{"$f":"'1'!C40","v":"A"},"00:00:00",{"$f":"SUM(B40,D40)","v":"00:00:00"},null,null,null,null,null,null,{"$f":"'1'!L40:N40","v":"Cert/CACIT"},null,null,575,{"$f":"'1'!P40","v":"poeng"}]
[{"$f":"'1'!A41","v":"A"},"00:00:00",{"$f":"'1'!C41","v":"D"},"00:00:00",{"$f":"SUM(E37:J40)","v":"00:00:00"},null,null,null,null,null,null,{"$f":"'1'!L41:N41","v":"- Derav i spesialøvelsene"},null,null,312,{"$f":"'1'!P41","v":"poeng"}]
[{"$f":"'1'!A42","v":"Anvendt tid totalt:"},null,null,null,{"$f":"SUM(E38:J41)","v":"00:00:00"},null,null,null,null,null,null,{"$f":"'1'!L42:N42","v":"- Derav i lydighetsøvelsene"},null,null,208,{"$f":"'1'!P42","v":"poeng"}]
[{"$f":"'1'!A43","v":"Øvelser:"},null,null,null,null,{"$f":"'1'!F43","v":"Koeff."},{"$f":"'1'!G43","v":"Karakter"},{"$f":"'1'!H43","v":"Karakter"},"Snitt",{"$f":"'1'!J43","v":"Poeng"}]
[{"$f":"'1'!A44","v":11},{"$f":"'1'!B44","v":"Feltsøk"},null,null,null,10,null,null,{"$f":"IF(G44=\"\",\"\",IF(H44=\"\",\"\",(G44+H44)/2))","v":""},{"$f":"IF(I44=\"\",\"\",IF(I44=0,\"I.G.\",I44*F44))","v":""},null,null,null,null,{"$f":"'1'!O44:P44","v":"Poeng"}]
[{"$f":"'1'!A45","v":12},{"$f":"'1'!B45","v":"Rapport"},null,null,null,{"$f":"'1'!F45","v":29},null,null,{"$f":"IF(G45=\"\",\"\",IF(H45=\"\",\"\",(G45+H45)/2))","v":""},{"$f":"IF(I45=\"\",\"\",IF(I45=0,\"I.G.\",I45*F45))","v":""},null,{"$f":"'1'!L45:N45","v":"Sum Lydighet"},null,null,{"$f":"J24","v":0}]
[{"$f":"'1'!A46","v":"Sum spesialøvelser:"},null,null,null,null,{"$f":"SUM(F44:F45)","v":39},null,null,null,null,null,{"$f":"'1'!L46:N46","v":"Sum Spesialøvelser"},null,null,{"$f":"IF(Resultatskj!H4=\"Rundering\",J35,IF(Resultatskj!H4=\"Spor\",J30,IF(Resultatskj!H4=\"Rapport\",J46,\"\")))","v":""}]
[null,null,null,null,null,null,null,null,null,null,null,{"$f":"'1'!L47:N47","v":"Totalpoeng"},null,null,{"$f":"SUM(O45:P46)","v":0}]
[null,null,null,null,null,null,null,null,null,null,null,{"$f":"'1'!L48","v":"Ikke godkj."},{"$f":"'1'!M48","v":"Godkj."},null,{"$f":"'1'!O48","v":"Cert"},{"$f":"'1'!P48","v":"Plass"}]
[{"$f":"IF(Resultatskj!C3=\"\",\"\",Resultatskj!C3)","v":""},null,null,null,null,{"$f":"IF(Resultatskj!C4=\"\",\"\",Resultatskj!C4)","v":""},null,null,null,null,null,{"$f":"IF(OR(O47<O37,O46<O38,O45<O39,O47=\"\"),\"X\",\"\")","v":"X"},{"$f":"IF(AND(O47>=O37,O46>=O38,O45>=O39,L49=\"\"),\"X\",\"\")","v":""},null,{"$f":"IF(AND(O47>=575,O46>=311.99,O45>207.99,L49=\"\"),\"X\",\"\")","v":""},{"$f":"Resultatskj!A10","v":"-"}]
["Underskrift dommere",null,null,null,null,null,null,null,null,null,null,{"$f":"Resultatskj!K26","v":"B.Strand/A.Bakken 15.07.2015/19.06.2018"}]
[]
[{"$f":"IF(Resultatskj!$C$3=\"\",\"\",Resultatskj!$C$3)","v":""}]
[{"$f":"IF(Resultatskj!$C$4=\"\",\"\",Resultatskj!$C$4)","v":""}]

{"sheet":"4","index":5,"n_rows":53,"n_cols":16,"rows_kept":53,"cut":false,"hidden":false,"merged":[[52,0,52,9],[2,0,2,15],[35,0,35,15],[36,0,36,1],[36,2,36,3],[43,14,43,15],[42,0,42,4],[43,11,43,13],[36,11,36,13],[37,11,37,13],[39,11,39,13],[40,11,40,13],[11,0,11,15],[16,1,16,4],[26,1,26,4],[27,1,27,4],[27,10,27,15],[0,5,0,15],[1,10,1,12],[1,2,1,5],[1,0,1,1],[0,2,0,4],[21,1,21,4],[16,10,16,15],[12,10,12,15],[13,10,13,15],[14,10,14,15],[12,0,12,4],[26,10,26,15],[3,10,3,11],[3,12,3,15],[4,0,4,1],[36,4,36,9],[32,1,32,4],[40,4,40,9],[33,1,33,4],[34,0,34,4],[39,4,39,9],[38,4,38,9],[37,4,37,9],[4,2,4,9],[4,10,4,11],[4,12,4,15],[3,0,3,1],[3,2,3,9],[5,0,5,1],[5,2,5,9],[5,10,5,11],[5,12,5,15],[20,10,20,15],[20,1,20,4],[17,10,17,15],[17,1,17,4],[24,0,24,15],[25,0,25,4],[15,10,15,15],[13,1,13,4],[14,1,14,4],[15,1,15,4],[23,0,23,4],[22,1,22,4],[21,10,21,15],[18,10,18,15],[19,10,19,15],[23,10,23,15],[18,1,18,4],[19,1,19,4],[22,10,22,15],[25,10,25,15],[34,10,34,15],[28,1,28,4],[29,0,29,4],[29,10,29,15],[30,0,30,15],[33,10,33,15],[32,10,32,15],[31,10,31,15],[31,0,31,4],[28,10,28,15],[38,11,38,13],[41,11,41,13],[44,1,44,4],[45,0,45,4],[46,11,46,13],[46,0,48,9],[43,1,43,4],[41,0,41,3],[41,4,41,9],[46,14,46,15],[45,14,45,15],[45,11,45,13],[44,14,44,15],[44,11,44,13],[51,11,51,15],[49,11,49,15],[47,12,47,13],[48,12,48,13],[49,0,49,9],[51,0,51,9]]}
[null,null,null,null,null,{"$f":"'1'!F1:R1","v":"Kl. A - DOMMERPROTOKOLL"}]
[{"$f":"'1'!A2:B2","v":"Dato:"},null,{"$f":"IF(Resultatskj!L2=\"\",\"\",Resultatskj!L2)","v":""},null,null,null,null,null,null,{"$f":"'1'!J2","v":"Gruppe:"},{"$f":"IF(Resultatskj!H4=\"\",\"\",Resultatskj!H4)","v":"Spor"},null,null,null,"Katalog nr.",{"$f":"Resultatskj!B11","v":""}]
[10]
[{"$f":"'1'!A4:B4","v":"Arrangør:"},null,{"$f":"IF(Resultatskj!$C$2=\"\",\"\",Resultatskj!$C$2)","v":""},null,null,null,null,null,null,null,{"$f":"'1'!K4:L4","v":"Hundens navn:"}]
[{"$f":"'1'!A5:B5","v":"Fører:"},null,null,null,null,null,null,null,null,null,{"$f":"'1'!K5:L5","v":"Reg.nr.:"}]
[{"$f":"'1'!A6:B6","v":"Klubb:"},null,null,null,null,null,null,null,null,null,{"$f":"'1'!K6:L6","v":"Rase:"}]
[]
[]
[null,"Klasse",null,"Liten",null,null,null,null,null,"Middels",null,null,"Stor"]
[]
[]
[{"$f":"'1'!A12","v":"Lydighet:"}]
[{"$f":"'1'!A13","v":"Øvelser:"},null,null,null,null,"Koeff.","Karakter","Karakter","Snitt","Poeng"]
[{"$f":"'1'!A14","v":1},{"$f":"'1'!B14","v":"Fri ved foten"},null,null,null,3,null,null,{"$f":"IF(G14=\"\",\"\",IF(H14=\"\",\"\",(G14+H14)/2))","v":""},{"$f":"IF(I14=\"\",\"\",IF(I14=0,\"I.G.\",I14*F14))","v":""}]
[{"$f":"'1'!A15","v":2},{"$f":"'1'!B15","v":"Innkalling m/stå og dekk"},null,null,null,3,null,null,{"$f":"IF(G15=\"\",\"\",IF(H15=\"\",\"\",(G15+H15)/2))","v":""},{"$f":"IF(I15=\"\",\"\",IF(I15=0,\"I.G.\",I15*F15))","v":""}]
[{"$f":"'1'!A16","v":3},{"$f":"'1'!B16","v":"Fremadsending"},null,null,null,3,null,null,"",""]
[{"$f":"'1'!A17","v":4},{"$f":"'1'!B17","v":"Kryp"},null,null,null,3,null,null,"",""]
[{"$f":"'1'!A18","v":5},{"$f":"'1'!B18","v":"Hals på kommando"},null,null,null,2,null,null,"",""]
[{"$f":"'1'!A19","v":6},{"$f":"'1'!B19","v":"Apportering metallapport"},null,null,null,3,null,null,"",""]
[{"$f":"'1'!A20","v":7},{"$f":"'1'!B20","v":"Apportering tung gjenstand"},null,null,null,3,null,null,"",""]
[{"$f":"'1'!A21","v":8},"Fritt hopp over hinder",null,null,null,2,null,null,"",""]
[{"$f":"'1'!A22","v":9},{"$f":"'1'!B22","v":"Stigeklatring"},null,null,null,2,null,null,"",""]
[{"$f":"'1'!A23","v":10},{"$f":"'1'!B23","v":"Fellesdekk"},null,null,null,2,null,null,"",""]
[{"$f":"'1'!A24","v":"Sum lydighet:"},null,null,null,null,{"$f":"SUM(F14:F23)","v":26},null,null,null,{"$f":"SUM(J14:J23)","v":0}]
[{"$f":"'1'!A25","v":"Sporgruppen:"}]
[{"$f":"'1'!A26","v":"Øvelser:"},null,null,null,null,"Koeff.","Karakter","Karakter","Snitt","Poeng"]
[{"$f":"'1'!A27","v":11},{"$f":"'1'!B27","v":"Feltsøk"},null,null,null,10,null,null,{"$f":"IF(G27=\"\",\"\",IF(H27=\"\",\"\",(G27+H27)/2))","v":""},{"$f":"IF(I27=\"\",\"\",IF(I27=0,\"I.G.\",I27*F27))","v":""}]
[{"$f":"'1'!A28","v":12},{"$f":"'1'!B28","v":"Sporoppsøk"},null,null,null,5,null,null,{"$f":"IF(G28=\"\",\"\",IF(H28=\"\",\"\",(G28+H28)/2))","v":""},{"$f":"IF(I28=\"\",\"\",IF(I28=0,\"I.G.\",I28*F28))","v":""}]
[{"$f":"'1'!A29","v":13},{"$f":"'1'!B29","v":"Spor"},null,null,null,24,null,null,"",""]
[{"$f":"'1'!A30","v":"Sum spesialøvelser:"},null,null,null,null,{"$f":"SUM(F27:F29)","v":39},null,null,null,{"$f":"IF(AND(J27=\"\",J28=\"\",J29=\"\"),\"\",SUM(J27:J29))","v":""}]
[{"$f":"'1'!A31","v":"Runderingsgruppen:"}]
[{"$f":"'1'!A32","v":"Øvelser:"},null,null,null,null,"Koeff.","Karakter","Karakter","Snitt","Poeng"]
[{"$f":"'1'!A33","v":11},{"$f":"'1'!B33","v":"Feltsøk"},null,null,null,10,null,null,{"$f":"IF(G33=\"\",\"\",IF(H33=\"\",\"\",(G33+H33)/2))","v":""},{"$f":"IF(I33=\"\",\"\",IF(I33=0,\"I.G.\",I33*F33))","v":""}]
[{"$f":"'1'!A34","v":12},{"$f":"'1'!B34","v":"Rundering"},null,null,null,{"$f":"'1'!F34","v":29},null,null,{"$f":"IF(G34=\"\",\"\",IF(H34=\"\",\"\",(G34+H34)/2))","v":""},{"$f":"IF(I34=\"\",\"\",IF(I34=0,\"I.G.\",I34*F34))","v":""}]
[{"$f":"'1'!A35","v":"Sum spesialøvelser:"},null,null,null,null,{"$f":"SUM(F33:F34)","v":39},null,null,null,{"$f":"IF(AND(J33=\"\",J34=\"\"),\"\",SUM(J33:J34))","v":""},null,"Godkjent",null,null,300,"poeng"]
[{"$f":"'1'!A36","v":"Rapportgruppen:"}]
[{"$f":"'1'!A37","v":"Start kl.:"},0,{"$f":"'1'!C37","v":"Ankomst kl.:"},0,{"$f":"'1'!E37:J37","v":"Anvendt tid:"},null,null,null,null,null,null,{"$f":"'1'!L37:N37","v":"Godkjent"},null,null,{"$f":"'1'!O37","v":325},{"$f":"'1'!P37","v":"poeng"}]
[{"$f":"'1'!A38","v":"B"},"00:00:00",{"$f":"'1'!C38","v":"A"},"00:00:00",{"$f":"SUM(B38,D38)","v":"00:00:00"},null,null,null,null,null,null,{"$f":"'1'!L38:N38","v":"- Derav i spesialøvelsene"},null,null,195,{"$f":"'1'!P38","v":"poeng"}]
[{"$f":"'1'!A39","v":"A"},"00:00:00",{"$f":"'1'!C39","v":"B"},"00:00:00",{"$f":"SUM(B39,D39)","v":"00:00:00"},null,null,null,null,null,null,"- Derav i lydighetsøvelsene",null,null,130,{"$f":"'1'!P39","v":"poeng"}]
[{"$f":"'1'!A40","v":"C"},"00:00:00",{"$f":"'1'!C40","v":"A"},"00:00:00",{"$f":"SUM(B40,D40)","v":"00:00:00"},null,null,null,null,null,null,{"$f":"'1'!L40:N40","v":"Cert/CACIT"},null,null,575,{"$f":"'1'!P40","v":"poeng"}]
[{"$f":"'1'!A41","v":"A"},"00:00:00",{"$f":"'1'!C41","v":"D"},"00:00:00",{"$f":"SUM(E37:J40)","v":"00:00:00"},null,null,null,null,null,null,{"$f":"'1'!L41:N41","v":"- Derav i spesialøvelsene"},null,null,312,{"$f":"'1'!P41","v":"poeng"}]
[{"$f":"'1'!A42","v":"Anvendt tid totalt:"},null,null,null,{"$f":"SUM(E38:J41)","v":"00:00:00"},null,null,null,null,null,null,{"$f":"'1'!L42:N42","v":"- Derav i lydighetsøvelsene"},null,null,208,{"$f":"'1'!P42","v":"poeng"}]
[{"$f":"'1'!A43","v":"Øvelser:"},null,null,null,null,{"$f":"'1'!F43","v":"Koeff."},{"$f":"'1'!G43","v":"Karakter"},{"$f":"'1'!H43","v":"Karakter"},"Snitt",{"$f":"'1'!J43","v":"Poeng"}]
[{"$f":"'1'!A44","v":11},{"$f":"'1'!B44","v":"Feltsøk"},null,null,null,10,null,null,{"$f":"IF(G44=\"\",\"\",IF(H44=\"\",\"\",(G44+H44)/2))","v":""},{"$f":"IF(I44=\"\",\"\",IF(I44=0,\"I.G.\",I44*F44))","v":""},null,null,null,null,{"$f":"'1'!O44:P44","v":"Poeng"}]
[{"$f":"'1'!A45","v":12},{"$f":"'1'!B45","v":"Rapport"},null,null,null,{"$f":"'1'!F45","v":29},null,null,{"$f":"IF(G45=\"\",\"\",IF(H45=\"\",\"\",(G45+H45)/2))","v":""},{"$f":"IF(I45=\"\",\"\",IF(I45=0,\"I.G.\",I45*F45))","v":""},null,{"$f":"'1'!L45:N45","v":"Sum Lydighet"},null,null,{"$f":"J24","v":0}]
[{"$f":"'1'!A46","v":"Sum spesialøvelser:"},null,null,null,null,{"$f":"SUM(F44:F45)","v":39},null,null,null,null,null,{"$f":"'1'!L46:N46","v":"Sum Spesialøvelser"},null,null,{"$f":"IF(Resultatskj!H4=\"Rundering\",J35,IF(Resultatskj!H4=\"Spor\",J30,IF(Resultatskj!H4=\"Rapport\",J46,\"\")))","v":""}]
[null,null,null,null,null,null,null,null,null,null,null,{"$f":"'1'!L47:N47","v":"Totalpoeng"},null,null,{"$f":"SUM(O45:P46)","v":0}]
[null,null,null,null,null,null,null,null,null,null,null,{"$f":"'1'!L48","v":"Ikke godkj."},{"$f":"'1'!M48","v":"Godkj."},null,{"$f":"'1'!O48","v":"Cert"},{"$f":"'1'!P48","v":"Plass"}]
[{"$f":"IF(Resultatskj!C3=\"\",\"\",Resultatskj!C3)","v":""},null,null,null,null,{"$f":"IF(Resultatskj!C4=\"\",\"\",Resultatskj!C4)","v":""},null,null,null,null,null,{"$f":"IF(OR(O47<O37,O46<O38,O45<O39,O47=\"\"),\"X\",\"\")","v":"X"},{"$f":"IF(AND(O47>=O37,O46>=O38,O45>=O39,L49=\"\"),\"X\",\"\")","v":""},null,{"$f":"IF(AND(O47>=575,O46>=311.99,O45>207.99,L49=\"\"),\"X\",\"\")","v":""},{"$f":"Resultatskj!A11","v":"-"}]
["Underskrift dommere",null,null,null,null,null,null,null,null,null,null,{"$f":"Resultatskj!K26","v":"B.Strand/A.Bakken 15.07.2015/19.06.2018"}]
[]
[{"$f":"IF(Resultatskj!$C$3=\"\",\"\",Resultatskj!$C$3)","v":""}]
[{"$f":"IF(Resultatskj!$C$4=\"\",\"\",Resultatskj!$C$4)","v":""}]

{"sheet":"5","index":6,"n_rows":53,"n_cols":16,"rows_kept":53,"cut":false,"hidden":false,"merged":[[51,0,51,9],[52,0,52,9],[27,10,27,15],[23,0,23,4],[23,10,23,15],[24,0,24,15],[26,1,26,4],[25,0,25,4],[25,10,25,15],[26,10,26,15],[39,11,39,13],[38,4,38,9],[31,0,31,4],[33,1,33,4],[36,4,36,9],[34,0,34,4],[0,5,0,15],[28,10,28,15],[3,2,3,9],[5,10,5,11],[5,12,5,15],[21,1,21,4],[17,10,17,15],[19,10,19,15],[18,1,18,4],[12,0,12,4],[12,10,12,15],[20,10,20,15],[3,10,3,11],[11,0,11,15],[4,0,4,1],[4,2,4,9],[33,10,33,15],[32,1,32,4],[32,10,32,15],[29,0,29,4],[29,10,29,15],[30,0,30,15],[31,10,31,15],[16,10,16,15],[16,1,16,4],[22,10,22,15],[17,1,17,4],[18,10,18,15],[20,1,20,4],[22,1,22,4],[19,1,19,4],[21,10,21,15],[27,1,27,4],[28,1,28,4],[1,10,1,12],[2,0,2,15],[13,10,13,15],[15,1,15,4],[15,10,15,15],[14,1,14,4],[14,10,14,15],[13,1,13,4],[5,0,5,1],[5,2,5,9],[1,0,1,1],[1,2,1,5],[4,10,4,11],[4,12,4,15],[3,12,3,15],[3,0,3,1],[44,14,44,15],[37,11,37,13],[44,11,44,13],[36,11,36,13],[43,11,43,13],[41,11,41,13],[40,11,40,13],[43,14,43,15],[35,0,35,15],[36,0,36,1],[36,2,36,3],[41,0,41,3],[41,4,41,9],[38,11,38,13],[37,4,37,9],[40,4,40,9],[39,4,39,9],[49,0,49,9],[0,2,0,4],[46,0,48,9],[51,11,51,15],[49,11,49,15],[46,14,46,15],[47,12,47,13],[48,12,48,13],[42,0,42,4],[44,1,44,4],[43,1,43,4],[45,0,45,4],[46,11,46,13],[45,11,45,13],[45,14,45,15],[34,10,34,15]]}
[null,null,null,null,null,{"$f":"'1'!F1:R1","v":"Kl. A - DOMMERPROTOKOLL"}]
[{"$f":"'1'!A2:B2","v":"Dato:"},null,{"$f":"IF(Resultatskj!L2=\"\",\"\",Resultatskj!L2)","v":""},null,null,null,null,null,null,{"$f":"'1'!J2","v":"Gruppe:"},{"$f":"IF(Resultatskj!H4=\"\",\"\",Resultatskj!H4)","v":"Spor"},null,null,null,"Katalog nr.",{"$f":"Resultatskj!B12","v":""}]
[10]
[{"$f":"'1'!A4:B4","v":"Arrangør:"},null,{"$f":"IF(Resultatskj!$C$2=\"\",\"\",Resultatskj!$C$2)","v":""},null,null,null,null,null,null,null,{"$f":"'1'!K4:L4","v":"Hundens navn:"}]
[{"$f":"'1'!A5:B5","v":"Fører:"},null,null,null,null,null,null,null,null,null,{"$f":"'1'!K5:L5","v":"Reg.nr.:"}]
[{"$f":"'1'!A6:B6","v":"Klubb:"},null,null,null,null,null,null,null,null,null,{"$f":"'1'!K6:L6","v":"Rase:"}]
[]
[]
[null,"Klasse",null,"Liten",null,null,null,null,null,"Middels",null,null,"Stor"]
[]
[]
[{"$f":"'1'!A12","v":"Lydighet:"}]
[{"$f":"'1'!A13","v":"Øvelser:"},null,null,null,null,"Koeff.","Karakter","Karakter","Snitt","Poeng"]
[{"$f":"'1'!A14","v":1},{"$f":"'1'!B14","v":"Fri ved foten"},null,null,null,3,null,null,{"$f":"IF(G14=\"\",\"\",IF(H14=\"\",\"\",(G14+H14)/2))","v":""},{"$f":"IF(I14=\"\",\"\",IF(I14=0,\"I.G.\",I14*F14))","v":""}]
[{"$f":"'1'!A15","v":2},{"$f":"'1'!B15","v":"Innkalling m/stå og dekk"},null,null,null,3,null,null,{"$f":"IF(G15=\"\",\"\",IF(H15=\"\",\"\",(G15+H15)/2))","v":""},{"$f":"IF(I15=\"\",\"\",IF(I15=0,\"I.G.\",I15*F15))","v":""}]
[{"$f":"'1'!A16","v":3},{"$f":"'1'!B16","v":"Fremadsending"},null,null,null,3,null,null,"",""]
[{"$f":"'1'!A17","v":4},{"$f":"'1'!B17","v":"Kryp"},null,null,null,3,null,null,"",""]
[{"$f":"'1'!A18","v":5},{"$f":"'1'!B18","v":"Hals på kommando"},null,null,null,2,null,null,"",""]
[{"$f":"'1'!A19","v":6},{"$f":"'1'!B19","v":"Apportering metallapport"},null,null,null,3,null,null,"",""]
[{"$f":"'1'!A20","v":7},{"$f":"'1'!B20","v":"Apportering tung gjenstand"},null,null,null,3,null,null,"",""]
[{"$f":"'1'!A21","v":8},"Fritt hopp over hinder",null,null,null,2,null,null,"",""]
[{"$f":"'1'!A22","v":9},{"$f":"'1'!B22","v":"Stigeklatring"},null,null,null,2,null,null,"",""]
[{"$f":"'1'!A23","v":10},{"$f":"'1'!B23","v":"Fellesdekk"},null,null,null,2,null,null,"",""]
[{"$f":"'1'!A24","v":"Sum lydighet:"},null,null,null,null,{"$f":"SUM(F14:F23)","v":26},null,null,null,{"$f":"SUM(J14:J23)","v":0}]
[{"$f":"'1'!A25","v":"Sporgruppen:"}]
[{"$f":"'1'!A26","v":"Øvelser:"},null,null,null,null,"Koeff.","Karakter","Karakter","Snitt","Poeng"]
[{"$f":"'1'!A27","v":11},{"$f":"'1'!B27","v":"Feltsøk"},null,null,null,10,null,null,{"$f":"IF(G27=\"\",\"\",IF(H27=\"\",\"\",(G27+H27)/2))","v":""},{"$f":"IF(I27=\"\",\"\",IF(I27=0,\"I.G.\",I27*F27))","v":""}]
[{"$f":"'1'!A28","v":12},{"$f":"'1'!B28","v":"Sporoppsøk"},null,null,null,5,null,null,{"$f":"IF(G28=\"\",\"\",IF(H28=\"\",\"\",(G28+H28)/2))","v":""},{"$f":"IF(I28=\"\",\"\",IF(I28=0,\"I.G.\",I28*F28))","v":""}]
[{"$f":"'1'!A29","v":13},{"$f":"'1'!B29","v":"Spor"},null,null,null,24,null,null,"",""]
[{"$f":"'1'!A30","v":"Sum spesialøvelser:"},null,null,null,null,{"$f":"SUM(F27:F29)","v":39},null,null,null,{"$f":"IF(AND(J27=\"\",J28=\"\",J29=\"\"),\"\",SUM(J27:J29))","v":""}]
[{"$f":"'1'!A31","v":"Runderingsgruppen:"}]
[{"$f":"'1'!A32","v":"Øvelser:"},null,null,null,null,"Koeff.","Karakter","Karakter","Snitt","Poeng"]
[{"$f":"'1'!A33","v":11},{"$f":"'1'!B33","v":"Feltsøk"},null,null,null,10,null,null,{"$f":"IF(G33=\"\",\"\",IF(H33=\"\",\"\",(G33+H33)/2))","v":""},{"$f":"IF(I33=\"\",\"\",IF(I33=0,\"I.G.\",I33*F33))","v":""}]
[{"$f":"'1'!A34","v":12},{"$f":"'1'!B34","v":"Rundering"},null,null,null,{"$f":"'1'!F34","v":29},null,null,{"$f":"IF(G34=\"\",\"\",IF(H34=\"\",\"\",(G34+H34)/2))","v":""},{"$f":"IF(I34=\"\",\"\",IF(I34=0,\"I.G.\",I34*F34))","v":""}]
[{"$f":"'1'!A35","v":"Sum spesialøvelser:"},null,null,null,null,{"$f":"SUM(F33:F34)","v":39},null,null,null,{"$f":"IF(AND(J33=\"\",J34=\"\"),\"\",SUM(J33:J34))","v":""},null,"Godkjent",null,null,300,"poeng"]
[{"$f":"'1'!A36","v":"Rapportgruppen:"}]
[{"$f":"'1'!A37","v":"Start kl.:"},0,{"$f":"'1'!C37","v":"Ankomst kl.:"},0,{"$f":"'1'!E37:J37","v":"Anvendt tid:"},null,null,null,null,null,null,{"$f":"'1'!L37:N37","v":"Godkjent"},null,null,{"$f":"'1'!O37","v":325},{"$f":"'1'!P37","v":"poeng"}]
[{"$f":"'1'!A38","v":"B"},"00:00:00",{"$f":"'1'!C38","v":"A"},"00:00:00",{"$f":"SUM(B38,D38)","v":"00:00:00"},null,null,null,null,null,null,{"$f":"'1'!L38:N38","v":"- Derav i spesialøvelsene"},null,null,195,{"$f":"'1'!P38","v":"poeng"}]
[{"$f":"'1'!A39","v":"A"},"00:00:00",{"$f":"'1'!C39","v":"B"},"00:00:00",{"$f":"SUM(B39,D39)","v":"00:00:00"},null,null,null,null,null,null,"- Derav i lydighetsøvelsene",null,null,130,{"$f":"'1'!P39","v":"poeng"}]
[{"$f":"'1'!A40","v":"C"},"00:00:00",{"$f":"'1'!C40","v":"A"},"00:00:00",{"$f":"SUM(B40,D40)","v":"00:00:00"},null,null,null,null,null,null,{"$f":"'1'!L40:N40","v":"Cert/CACIT"},null,null,575,{"$f":"'1'!P40","v":"poeng"}]
[{"$f":"'1'!A41","v":"A"},"00:00:00",{"$f":"'1'!C41","v":"D"},"00:00:00",{"$f":"SUM(E37:J40)","v":"00:00:00"},null,null,null,null,null,null,{"$f":"'1'!L41:N41","v":"- Derav i spesialøvelsene"},null,null,312,{"$f":"'1'!P41","v":"poeng"}]
[{"$f":"'1'!A42","v":"Anvendt tid totalt:"},null,null,null,{"$f":"SUM(E38:J41)","v":"00:00:00"},null,null,null,null,null,null,{"$f":"'1'!L42:N42","v":"- Derav i lydighetsøvelsene"},null,null,208,{"$f":"'1'!P42","v":"poeng"}]
[{"$f":"'1'!A43","v":"Øvelser:"},null,null,null,null,{"$f":"'1'!F43","v":"Koeff."},{"$f":"'1'!G43","v":"Karakter"},{"$f":"'1'!H43","v":"Karakter"},"Snitt",{"$f":"'1'!J43","v":"Poeng"}]
[{"$f":"'1'!A44","v":11},{"$f":"'1'!B44","v":"Feltsøk"},null,null,null,10,null,null,{"$f":"IF(G44=\"\",\"\",IF(H44=\"\",\"\",(G44+H44)/2))","v":""},{"$f":"IF(I44=\"\",\"\",IF(I44=0,\"I.G.\",I44*F44))","v":""},null,null,null,null,{"$f":"'1'!O44:P44","v":"Poeng"}]
[{"$f":"'1'!A45","v":12},{"$f":"'1'!B45","v":"Rapport"},null,null,null,{"$f":"'1'!F45","v":29},null,null,{"$f":"IF(G45=\"\",\"\",IF(H45=\"\",\"\",(G45+H45)/2))","v":""},{"$f":"IF(I45=\"\",\"\",IF(I45=0,\"I.G.\",I45*F45))","v":""},null,{"$f":"'1'!L45:N45","v":"Sum Lydighet"},null,null,{"$f":"J24","v":0}]
[{"$f":"'1'!A46","v":"Sum spesialøvelser:"},null,null,null,null,{"$f":"SUM(F44:F45)","v":39},null,null,null,null,null,{"$f":"'1'!L46:N46","v":"Sum Spesialøvelser"},null,null,{"$f":"IF(Resultatskj!H4=\"Rundering\",J35,IF(Resultatskj!H4=\"Spor\",J30,IF(Resultatskj!H4=\"Rapport\",J46,\"\")))","v":""}]
[null,null,null,null,null,null,null,null,null,null,null,{"$f":"'1'!L47:N47","v":"Totalpoeng"},null,null,{"$f":"SUM(O45:P46)","v":0}]
[null,null,null,null,null,null,null,null,null,null,null,{"$f":"'1'!L48","v":"Ikke godkj."},{"$f":"'1'!M48","v":"Godkj."},null,{"$f":"'1'!O48","v":"Cert"},{"$f":"'1'!P48","v":"Plass"}]
[{"$f":"IF(Resultatskj!C3=\"\",\"\",Resultatskj!C3)","v":""},null,null,null,null,{"$f":"IF(Resultatskj!C4=\"\",\"\",Resultatskj!C4)","v":""},null,null,null,null,null,{"$f":"IF(OR(O47<O37,O46<O38,O45<O39,O47=\"\"),\"X\",\"\")","v":"X"},{"$f":"IF(AND(O47>=O37,O46>=O38,O45>=O39,L49=\"\"),\"X\",\"\")","v":""},null,{"$f":"IF(AND(O47>=575,O46>=311.99,O45>207.99,L49=\"\"),\"X\",\"\")","v":""},{"$f":"Resultatskj!A12","v":"-"}]
["Underskrift dommere",null,null,null,null,null,null,null,null,null,null,{"$f":"Resultatskj!K26","v":"B.Strand/A.Bakken 15.07.2015/19.06.2018"}]
[]
[{"$f":"IF(Resultatskj!$C$3=\"\",\"\",Resultatskj!$C$3)","v":""}]
[{"$f":"IF(Resultatskj!$C$4=\"\",\"\",Resultatskj!$C$4)","v":""}]

{"sheet":"6","index":7,"n_rows":53,"n_cols":16,"rows_kept":53,"cut":false,"hidden":false,"merged":[[52,0,52,9],[2,0,2,15],[28,10,28,15],[27,10,27,15],[11,0,11,15],[16,1,16,4],[26,1,26,4],[27,1,27,4],[16,10,16,15],[18,10,18,15],[19,10,19,15],[22,1,22,4],[23,0,23,4],[12,10,12,15],[13,10,13,15],[14,10,14,15],[3,0,3,1],[3,2,3,9],[3,10,3,11],[3,12,3,15],[5,2,5,9],[5,10,5,11],[5,12,5,15],[4,0,4,1],[4,2,4,9],[4,10,4,11],[4,12,4,15],[5,0,5,1],[0,5,0,15],[1,10,1,12],[1,2,1,5],[1,0,1,1],[0,2,0,4],[43,14,43,15],[43,1,43,4],[36,4,36,9],[42,0,42,4],[43,11,43,13],[36,2,36,3],[41,11,41,13],[41,0,41,3],[41,4,41,9],[37,11,37,13],[39,11,39,13],[38,11,38,13],[40,4,40,9],[39,4,39,9],[40,11,40,13],[37,4,37,9],[18,1,18,4],[19,1,19,4],[24,0,24,15],[31,0,31,4],[33,1,33,4],[21,1,21,4],[21,10,21,15],[22,10,22,15],[23,10,23,15],[32,1,32,4],[30,0,30,15],[32,10,32,15],[31,10,31,15],[25,0,25,4],[25,10,25,15],[26,10,26,15],[17,1,17,4],[17,10,17,15],[12,0,12,4],[15,10,15,15],[13,1,13,4],[14,1,14,4],[15,1,15,4],[38,4,38,9],[34,10,34,15],[33,10,33,15],[20,10,20,15],[20,1,20,4],[35,0,35,15],[36,0,36,1],[36,11,36,13],[28,1,28,4],[34,0,34,4],[29,0,29,4],[29,10,29,15],[44,1,44,4],[45,0,45,4],[46,11,46,13],[44,11,44,13],[46,14,46,15],[45,14,45,15],[45,11,45,13],[44,14,44,15],[46,0,48,9],[51,11,51,15],[49,11,49,15],[47,12,47,13],[48,12,48,13],[49,0,49,9],[51,0,51,9]]}
[null,null,null,null,null,{"$f":"'1'!F1:R1","v":"Kl. A - DOMMERPROTOKOLL"}]
[{"$f":"'1'!A2:B2","v":"Dato:"},null,{"$f":"IF(Resultatskj!L2=\"\",\"\",Resultatskj!L2)","v":""},null,null,null,null,null,null,{"$f":"'1'!J2","v":"Gruppe:"},{"$f":"IF(Resultatskj!H4=\"\",\"\",Resultatskj!H4)","v":"Spor"},null,null,null,"Katalog nr.",{"$f":"Resultatskj!B13","v":""}]
[10]
[{"$f":"'1'!A4:B4","v":"Arrangør:"},null,{"$f":"IF(Resultatskj!$C$2=\"\",\"\",Resultatskj!$C$2)","v":""},null,null,null,null,null,null,null,{"$f":"'1'!K4:L4","v":"Hundens navn:"}]
[{"$f":"'1'!A5:B5","v":"Fører:"},null,null,null,null,null,null,null,null,null,{"$f":"'1'!K5:L5","v":"Reg.nr.:"}]
[{"$f":"'1'!A6:B6","v":"Klubb:"},null,null,null,null,null,null,null,null,null,{"$f":"'1'!K6:L6","v":"Rase:"}]
[]
[]
[null,"Klasse",null,"Liten",null,null,null,null,null,"Middels",null,null,"Stor"]
[]
[]
[{"$f":"'1'!A12","v":"Lydighet:"}]
[{"$f":"'1'!A13","v":"Øvelser:"},null,null,null,null,"Koeff.","Karakter","Karakter","Snitt","Poeng"]
[{"$f":"'1'!A14","v":1},{"$f":"'1'!B14","v":"Fri ved foten"},null,null,null,3,null,null,{"$f":"IF(G14=\"\",\"\",IF(H14=\"\",\"\",(G14+H14)/2))","v":""},{"$f":"IF(I14=\"\",\"\",IF(I14=0,\"I.G.\",I14*F14))","v":""}]
[{"$f":"'1'!A15","v":2},{"$f":"'1'!B15","v":"Innkalling m/stå og dekk"},null,null,null,3,null,null,{"$f":"IF(G15=\"\",\"\",IF(H15=\"\",\"\",(G15+H15)/2))","v":""},{"$f":"IF(I15=\"\",\"\",IF(I15=0,\"I.G.\",I15*F15))","v":""}]
[{"$f":"'1'!A16","v":3},{"$f":"'1'!B16","v":"Fremadsending"},null,null,null,3,null,null,"",""]
[{"$f":"'1'!A17","v":4},{"$f":"'1'!B17","v":"Kryp"},null,null,null,3,null,null,"",""]
[{"$f":"'1'!A18","v":5},{"$f":"'1'!B18","v":"Hals på kommando"},null,null,null,2,null,null,"",""]
[{"$f":"'1'!A19","v":6},{"$f":"'1'!B19","v":"Apportering metallapport"},null,null,null,3,null,null,"",""]
[{"$f":"'1'!A20","v":7},{"$f":"'1'!B20","v":"Apportering tung gjenstand"},null,null,null,3,null,null,"",""]
[{"$f":"'1'!A21","v":8},"Fritt hopp over hinder",null,null,null,2,null,null,"",""]
[{"$f":"'1'!A22","v":9},{"$f":"'1'!B22","v":"Stigeklatring"},null,null,null,2,null,null,"",""]
[{"$f":"'1'!A23","v":10},{"$f":"'1'!B23","v":"Fellesdekk"},null,null,null,2,null,null,"",""]
[{"$f":"'1'!A24","v":"Sum lydighet:"},null,null,null,null,{"$f":"SUM(F14:F23)","v":26},null,null,null,{"$f":"SUM(J14:J23)","v":0}]
[{"$f":"'1'!A25","v":"Sporgruppen:"}]
[{"$f":"'1'!A26","v":"Øvelser:"},null,null,null,null,"Koeff.","Karakter","Karakter","Snitt","Poeng"]
[{"$f":"'1'!A27","v":11},{"$f":"'1'!B27","v":"Feltsøk"},null,null,null,10,null,null,{"$f":"IF(G27=\"\",\"\",IF(H27=\"\",\"\",(G27+H27)/2))","v":""},{"$f":"IF(I27=\"\",\"\",IF(I27=0,\"I.G.\",I27*F27))","v":""}]
[{"$f":"'1'!A28","v":12},{"$f":"'1'!B28","v":"Sporoppsøk"},null,null,null,5,null,null,{"$f":"IF(G28=\"\",\"\",IF(H28=\"\",\"\",(G28+H28)/2))","v":""},{"$f":"IF(I28=\"\",\"\",IF(I28=0,\"I.G.\",I28*F28))","v":""}]
[{"$f":"'1'!A29","v":13},{"$f":"'1'!B29","v":"Spor"},null,null,null,24,null,null,"",""]
[{"$f":"'1'!A30","v":"Sum spesialøvelser:"},null,null,null,null,{"$f":"SUM(F27:F29)","v":39},null,null,null,{"$f":"IF(AND(J27=\"\",J28=\"\",J29=\"\"),\"\",SUM(J27:J29))","v":""}]
[{"$f":"'1'!A31","v":"Runderingsgruppen:"}]
[{"$f":"'1'!A32","v":"Øvelser:"},null,null,null,null,"Koeff.","Karakter","Karakter","Snitt","Poeng"]
[{"$f":"'1'!A33","v":11},{"$f":"'1'!B33","v":"Feltsøk"},null,null,null,10,null,null,{"$f":"IF(G33=\"\",\"\",IF(H33=\"\",\"\",(G33+H33)/2))","v":""},{"$f":"IF(I33=\"\",\"\",IF(I33=0,\"I.G.\",I33*F33))","v":""}]
[{"$f":"'1'!A34","v":12},{"$f":"'1'!B34","v":"Rundering"},null,null,null,{"$f":"'1'!F34","v":29},null,null,{"$f":"IF(G34=\"\",\"\",IF(H34=\"\",\"\",(G34+H34)/2))","v":""},{"$f":"IF(I34=\"\",\"\",IF(I34=0,\"I.G.\",I34*F34))","v":""}]
[{"$f":"'1'!A35","v":"Sum spesialøvelser:"},null,null,null,null,{"$f":"SUM(F33:F34)","v":39},null,null,null,{"$f":"IF(AND(J33=\"\",J34=\"\"),\"\",SUM(J33:J34))","v":""},null,"Godkjent",null,null,300,"poeng"]
[{"$f":"'1'!A36","v":"Rapportgruppen:"}]
[{"$f":"'1'!A37","v":"Start kl.:"},0,{"$f":"'1'!C37","v":"Ankomst kl.:"},0,{"$f":"'1'!E37:J37","v":"Anvendt tid:"},null,null,null,null,null,null,{"$f":"'1'!L37:N37","v":"Godkjent"},null,null,{"$f":"'1'!O37","v":325},{"$f":"'1'!P37","v":"poeng"}]
[{"$f":"'1'!A38","v":"B"},"00:00:00",{"$f":"'1'!C38","v":"A"},"00:00:00",{"$f":"SUM(B38,D38)","v":"00:00:00"},null,null,null,null,null,null,{"$f":"'1'!L38:N38","v":"- Derav i spesialøvelsene"},null,null,195,{"$f":"'1'!P38","v":"poeng"}]
[{"$f":"'1'!A39","v":"A"},"00:00:00",{"$f":"'1'!C39","v":"B"},"00:00:00",{"$f":"SUM(B39,D39)","v":"00:00:00"},null,null,null,null,null,null,"- Derav i lydighetsøvelsene",null,null,130,{"$f":"'1'!P39","v":"poeng"}]
[{"$f":"'1'!A40","v":"C"},"00:00:00",{"$f":"'1'!C40","v":"A"},"00:00:00",{"$f":"SUM(B40,D40)","v":"00:00:00"},null,null,null,null,null,null,{"$f":"'1'!L40:N40","v":"Cert/CACIT"},null,null,575,{"$f":"'1'!P40","v":"poeng"}]
[{"$f":"'1'!A41","v":"A"},"00:00:00",{"$f":"'1'!C41","v":"D"},"00:00:00",{"$f":"SUM(E37:J40)","v":"00:00:00"},null,null,null,null,null,null,{"$f":"'1'!L41:N41","v":"- Derav i spesialøvelsene"},null,null,312,{"$f":"'1'!P41","v":"poeng"}]
[{"$f":"'1'!A42","v":"Anvendt tid totalt:"},null,null,null,{"$f":"SUM(E38:J41)","v":"00:00:00"},null,null,null,null,null,null,{"$f":"'1'!L42:N42","v":"- Derav i lydighetsøvelsene"},null,null,208,{"$f":"'1'!P42","v":"poeng"}]
[{"$f":"'1'!A43","v":"Øvelser:"},null,null,null,null,{"$f":"'1'!F43","v":"Koeff."},{"$f":"'1'!G43","v":"Karakter"},{"$f":"'1'!H43","v":"Karakter"},"Snitt",{"$f":"'1'!J43","v":"Poeng"}]
[{"$f":"'1'!A44","v":11},{"$f":"'1'!B44","v":"Feltsøk"},null,null,null,10,null,null,{"$f":"IF(G44=\"\",\"\",IF(H44=\"\",\"\",(G44+H44)/2))","v":""},{"$f":"IF(I44=\"\",\"\",IF(I44=0,\"I.G.\",I44*F44))","v":""},null,null,null,null,{"$f":"'1'!O44:P44","v":"Poeng"}]
[{"$f":"'1'!A45","v":12},{"$f":"'1'!B45","v":"Rapport"},null,null,null,{"$f":"'1'!F45","v":29},null,null,{"$f":"IF(G45=\"\",\"\",IF(H45=\"\",\"\",(G45+H45)/2))","v":""},{"$f":"IF(I45=\"\",\"\",IF(I45=0,\"I.G.\",I45*F45))","v":""},null,{"$f":"'1'!L45:N45","v":"Sum Lydighet"},null,null,{"$f":"J24","v":0}]
[{"$f":"'1'!A46","v":"Sum spesialøvelser:"},null,null,null,null,{"$f":"SUM(F44:F45)","v":39},null,null,null,null,null,{"$f":"'1'!L46:N46","v":"Sum Spesialøvelser"},null,null,{"$f":"IF(Resultatskj!H4=\"Rundering\",J35,IF(Resultatskj!H4=\"Spor\",J30,IF(Resultatskj!H4=\"Rapport\",J46,\"\")))","v":""}]
[null,null,null,null,null,null,null,null,null,null,null,{"$f":"'1'!L47:N47","v":"Totalpoeng"},null,null,{"$f":"SUM(O45:P46)","v":0}]
[null,null,null,null,null,null,null,null,null,null,null,{"$f":"'1'!L48","v":"Ikke godkj."},{"$f":"'1'!M48","v":"Godkj."},null,{"$f":"'1'!O48","v":"Cert"},{"$f":"'1'!P48","v":"Plass"}]
[{"$f":"IF(Resultatskj!C3=\"\",\"\",Resultatskj!C3)","v":""},null,null,null,null,{"$f":"IF(Resultatskj!C4=\"\",\"\",Resultatskj!C4)","v":""},null,null,null,null,null,{"$f":"IF(OR(O47<O37,O46<O38,O45<O39,O47=\"\"),\"X\",\"\")","v":"X"},{"$f":"IF(AND(O47>=O37,O46>=O38,O45>=O39,L49=\"\"),\"X\",\"\")","v":""},null,{"$f":"IF(AND(O47>=575,O46>=311.99,O45>207.99,L49=\"\"),\"X\",\"\")","v":""},{"$f":"Resultatskj!A13","v":"-"}]
["Underskrift dommere",null,null,null,null,null,null,null,null,null,null,{"$f":"Resultatskj!K26","v":"B.Strand/A.Bakken 15.07.2015/19.06.2018"}]
[]
[{"$f":"IF(Resultatskj!$C$3=\"\",\"\",Resultatskj!$C$3)","v":""}]
[{"$f":"IF(Resultatskj!$C$4=\"\",\"\",Resultatskj!$C$4)","v":""}]

{"sheet":"7","index":8,"n_rows":53,"n_cols":16,"rows_kept":53,"cut":false,"hidden":false,"merged":[[52,0,52,9],[18,10,18,15],[20,1,20,4],[17,10,17,15],[19,10,19,15],[32,1,32,4],[25,10,25,15],[26,10,26,15],[32,10,32,15],[27,10,27,15],[31,10,31,15],[20,10,20,15],[22,10,22,15],[23,10,23,15],[24,0,24,15],[21,10,21,15],[0,5,0,15],[28,10,28,15],[45,11,45,13],[3,2,3,9],[38,4,38,9],[40,11,40,13],[39,11,39,13],[39,4,39,9],[33,10,33,15],[3,12,3,15],[16,10,16,15],[11,0,11,15],[16,1,16,4],[3,0,3,1],[3,10,3,11],[17,1,17,4],[1,0,1,1],[1,2,1,5],[1,10,1,12],[2,0,2,15],[4,10,4,11],[4,0,4,1],[4,2,4,9],[4,12,4,15],[5,0,5,1],[5,2,5,9],[5,10,5,11],[5,12,5,15],[15,1,15,4],[15,10,15,15],[14,10,14,15],[12,0,12,4],[12,10,12,15],[13,1,13,4],[13,10,13,15],[35,0,35,15],[36,0,36,1],[36,2,36,3],[41,0,41,3],[41,4,41,9],[37,11,37,13],[37,4,37,9],[40,4,40,9],[34,10,34,15],[29,10,29,15],[30,0,30,15],[31,0,31,4],[33,1,33,4],[34,0,34,4],[25,0,25,4],[28,1,28,4],[29,0,29,4],[18,1,18,4],[19,1,19,4],[26,1,26,4],[27,1,27,4],[22,1,22,4],[23,0,23,4],[21,1,21,4],[0,2,0,4],[44,14,44,15],[44,11,44,13],[47,12,47,13],[48,12,48,13],[36,4,36,9],[36,11,36,13],[46,0,48,9],[46,11,46,13],[46,14,46,15],[45,14,45,15],[42,0,42,4],[43,11,43,13],[43,14,43,15],[43,1,43,4],[14,1,14,4],[51,11,51,15],[49,11,49,15],[38,11,38,13],[44,1,44,4],[45,0,45,4],[49,0,49,9],[41,11,41,13],[51,0,51,9]]}
[null,null,null,null,null,{"$f":"'1'!F1:R1","v":"Kl. A - DOMMERPROTOKOLL"}]
[{"$f":"'1'!A2:B2","v":"Dato:"},null,{"$f":"IF(Resultatskj!L2=\"\",\"\",Resultatskj!L2)","v":""},null,null,null,null,null,null,{"$f":"'1'!J2","v":"Gruppe:"},{"$f":"IF(Resultatskj!H4=\"\",\"\",Resultatskj!H4)","v":"Spor"},null,null,null,"Katalog nr.",{"$f":"Resultatskj!B14","v":""}]
[]
[{"$f":"'1'!A4:B4","v":"Arrangør:"},null,{"$f":"IF(Resultatskj!$C$2=\"\",\"\",Resultatskj!$C$2)","v":""},null,null,null,null,null,null,null,{"$f":"'1'!K4:L4","v":"Hundens navn:"}]
[{"$f":"'1'!A5:B5","v":"Fører:"},null,null,null,null,null,null,null,null,null,{"$f":"'1'!K5:L5","v":"Reg.nr.:"}]
[{"$f":"'1'!A6:B6","v":"Klubb:"},null,null,null,null,null,null,null,null,null,{"$f":"'1'!K6:L6","v":"Rase:"}]
[]
[]
[null,"Klasse",null,"Liten",null,null,null,null,null,"Middels",null,null,"Stor"]
[]
[]
[{"$f":"'1'!A12","v":"Lydighet:"}]
[{"$f":"'1'!A13","v":"Øvelser:"},null,null,null,null,"Koeff.","Karakter","Karakter","Snitt","Poeng"]
[{"$f":"'1'!A14","v":1},{"$f":"'1'!B14","v":"Fri ved foten"},null,null,null,3,null,null,{"$f":"IF(G14=\"\",\"\",IF(H14=\"\",\"\",(G14+H14)/2))","v":""},{"$f":"IF(I14=\"\",\"\",IF(I14=0,\"I.G.\",I14*F14))","v":""}]
[{"$f":"'1'!A15","v":2},{"$f":"'1'!B15","v":"Innkalling m/stå og dekk"},null,null,null,3,null,null,{"$f":"IF(G15=\"\",\"\",IF(H15=\"\",\"\",(G15+H15)/2))","v":""},{"$f":"IF(I15=\"\",\"\",IF(I15=0,\"I.G.\",I15*F15))","v":""}]
[{"$f":"'1'!A16","v":3},{"$f":"'1'!B16","v":"Fremadsending"},null,null,null,3,null,null,"",""]
[{"$f":"'1'!A17","v":4},{"$f":"'1'!B17","v":"Kryp"},null,null,null,3,null,null,"",""]
[{"$f":"'1'!A18","v":5},{"$f":"'1'!B18","v":"Hals på kommando"},null,null,null,2,null,null,"",""]
[{"$f":"'1'!A19","v":6},{"$f":"'1'!B19","v":"Apportering metallapport"},null,null,null,3,null,null,"",""]
[{"$f":"'1'!A20","v":7},{"$f":"'1'!B20","v":"Apportering tung gjenstand"},null,null,null,3,null,null,"",""]
[{"$f":"'1'!A21","v":8},"Fritt hopp over hinder",null,null,null,2,null,null,"",""]
[{"$f":"'1'!A22","v":9},{"$f":"'1'!B22","v":"Stigeklatring"},null,null,null,2,null,null,"",""]
[{"$f":"'1'!A23","v":10},{"$f":"'1'!B23","v":"Fellesdekk"},null,null,null,2,null,null,"",""]
[{"$f":"'1'!A24","v":"Sum lydighet:"},null,null,null,null,{"$f":"SUM(F14:F23)","v":26},null,null,null,{"$f":"SUM(J14:J23)","v":0}]
[{"$f":"'1'!A25","v":"Sporgruppen:"}]
[{"$f":"'1'!A26","v":"Øvelser:"},null,null,null,null,"Koeff.","Karakter","Karakter","Snitt","Poeng"]
[{"$f":"'1'!A27","v":11},{"$f":"'1'!B27","v":"Feltsøk"},null,null,null,10,null,null,{"$f":"IF(G27=\"\",\"\",IF(H27=\"\",\"\",(G27+H27)/2))","v":""},{"$f":"IF(I27=\"\",\"\",IF(I27=0,\"I.G.\",I27*F27))","v":""}]
[{"$f":"'1'!A28","v":12},{"$f":"'1'!B28","v":"Sporoppsøk"},null,null,null,5,null,null,{"$f":"IF(G28=\"\",\"\",IF(H28=\"\",\"\",(G28+H28)/2))","v":""},{"$f":"IF(I28=\"\",\"\",IF(I28=0,\"I.G.\",I28*F28))","v":""}]
[{"$f":"'1'!A29","v":13},{"$f":"'1'!B29","v":"Spor"},null,null,null,24,null,null,"",""]
[{"$f":"'1'!A30","v":"Sum spesialøvelser:"},null,null,null,null,{"$f":"SUM(F27:F29)","v":39},null,null,null,{"$f":"IF(AND(J27=\"\",J28=\"\",J29=\"\"),\"\",SUM(J27:J29))","v":""}]
[{"$f":"'1'!A31","v":"Runderingsgruppen:"}]
[{"$f":"'1'!A32","v":"Øvelser:"},null,null,null,null,"Koeff.","Karakter","Karakter","Snitt","Poeng"]
[{"$f":"'1'!A33","v":11},{"$f":"'1'!B33","v":"Feltsøk"},null,null,null,10,null,null,{"$f":"IF(G33=\"\",\"\",IF(H33=\"\",\"\",(G33+H33)/2))","v":""},{"$f":"IF(I33=\"\",\"\",IF(I33=0,\"I.G.\",I33*F33))","v":""}]
[{"$f":"'1'!A34","v":12},{"$f":"'1'!B34","v":"Rundering"},null,null,null,{"$f":"'1'!F34","v":29},null,null,{"$f":"IF(G34=\"\",\"\",IF(H34=\"\",\"\",(G34+H34)/2))","v":""},{"$f":"IF(I34=\"\",\"\",IF(I34=0,\"I.G.\",I34*F34))","v":""}]
[{"$f":"'1'!A35","v":"Sum spesialøvelser:"},null,null,null,null,{"$f":"SUM(F33:F34)","v":39},null,null,null,{"$f":"IF(AND(J33=\"\",J34=\"\"),\"\",SUM(J33:J34))","v":""},null,"Godkjent",null,null,300,"poeng"]
[{"$f":"'1'!A36","v":"Rapportgruppen:"}]
[{"$f":"'1'!A37","v":"Start kl.:"},0,{"$f":"'1'!C37","v":"Ankomst kl.:"},0,{"$f":"'1'!E37:J37","v":"Anvendt tid:"},null,null,null,null,null,null,{"$f":"'1'!L37:N37","v":"Godkjent"},null,null,{"$f":"'1'!O37","v":325},{"$f":"'1'!P37","v":"poeng"}]
[{"$f":"'1'!A38","v":"B"},"00:00:00",{"$f":"'1'!C38","v":"A"},"00:00:00",{"$f":"SUM(B38,D38)","v":"00:00:00"},null,null,null,null,null,null,{"$f":"'1'!L38:N38","v":"- Derav i spesialøvelsene"},null,null,195,{"$f":"'1'!P38","v":"poeng"}]
[{"$f":"'1'!A39","v":"A"},"00:00:00",{"$f":"'1'!C39","v":"B"},"00:00:00",{"$f":"SUM(B39,D39)","v":"00:00:00"},null,null,null,null,null,null,"- Derav i lydighetsøvelsene",null,null,130,{"$f":"'1'!P39","v":"poeng"}]
[{"$f":"'1'!A40","v":"C"},"00:00:00",{"$f":"'1'!C40","v":"A"},"00:00:00",{"$f":"SUM(B40,D40)","v":"00:00:00"},null,null,null,null,null,null,{"$f":"'1'!L40:N40","v":"Cert/CACIT"},null,null,575,{"$f":"'1'!P40","v":"poeng"}]
[{"$f":"'1'!A41","v":"A"},"00:00:00",{"$f":"'1'!C41","v":"D"},"00:00:00",{"$f":"SUM(E37:J40)","v":"00:00:00"},null,null,null,null,null,null,{"$f":"'1'!L41:N41","v":"- Derav i spesialøvelsene"},null,null,312,{"$f":"'1'!P41","v":"poeng"}]
[{"$f":"'1'!A42","v":"Anvendt tid totalt:"},null,null,null,{"$f":"SUM(E38:J41)","v":"00:00:00"},null,null,null,null,null,null,{"$f":"'1'!L42:N42","v":"- Derav i lydighetsøvelsene"},null,null,208,{"$f":"'1'!P42","v":"poeng"}]
[{"$f":"'1'!A43","v":"Øvelser:"},null,null,null,null,{"$f":"'1'!F43","v":"Koeff."},{"$f":"'1'!G43","v":"Karakter"},{"$f":"'1'!H43","v":"Karakter"},"Snitt",{"$f":"'1'!J43","v":"Poeng"}]
[{"$f":"'1'!A44","v":11},{"$f":"'1'!B44","v":"Feltsøk"},null,null,null,10,null,null,{"$f":"IF(G44=\"\",\"\",IF(H44=\"\",\"\",(G44+H44)/2))","v":""},{"$f":"IF(I44=\"\",\"\",IF(I44=0,\"I.G.\",I44*F44))","v":""},null,null,null,null,{"$f":"'1'!O44:P44","v":"Poeng"}]
[{"$f":"'1'!A45","v":12},{"$f":"'1'!B45","v":"Rapport"},null,null,null,{"$f":"'1'!F45","v":29},null,null,{"$f":"IF(G45=\"\",\"\",IF(H45=\"\",\"\",(G45+H45)/2))","v":""},{"$f":"IF(I45=\"\",\"\",IF(I45=0,\"I.G.\",I45*F45))","v":""},null,{"$f":"'1'!L45:N45","v":"Sum Lydighet"},null,null,{"$f":"J24","v":0}]
[{"$f":"'1'!A46","v":"Sum spesialøvelser:"},null,null,null,null,{"$f":"SUM(F44:F45)","v":39},null,null,null,null,null,{"$f":"'1'!L46:N46","v":"Sum Spesialøvelser"},null,null,{"$f":"IF(Resultatskj!H4=\"Rundering\",J35,IF(Resultatskj!H4=\"Spor\",J30,IF(Resultatskj!H4=\"Rapport\",J46,\"\")))","v":""}]
[null,null,null,null,null,null,null,null,null,null,null,{"$f":"'1'!L47:N47","v":"Totalpoeng"},null,null,{"$f":"SUM(O45:P46)","v":0}]
[null,null,null,null,null,null,null,null,null,null,null,{"$f":"'1'!L48","v":"Ikke godkj."},{"$f":"'1'!M48","v":"Godkj."},null,{"$f":"'1'!O48","v":"Cert"},{"$f":"'1'!P48","v":"Plass"}]
[{"$f":"IF(Resultatskj!C3=\"\",\"\",Resultatskj!C3)","v":""},null,null,null,null,{"$f":"IF(Resultatskj!C4=\"\",\"\",Resultatskj!C4)","v":""},null,null,null,null,null,{"$f":"IF(OR(O47<O37,O46<O38,O45<O39,O47=\"\"),\"X\",\"\")","v":"X"},{"$f":"IF(AND(O47>=O37,O46>=O38,O45>=O39,L49=\"\"),\"X\",\"\")","v":""},null,{"$f":"IF(AND(O47>=575,O46>=311.99,O45>207.99,L49=\"\"),\"X\",\"\")","v":""},{"$f":"Resultatskj!A14","v":"-"}]
["Underskrift dommere",null,null,null,null,null,null,null,null,null,null,{"$f":"Resultatskj!K26","v":"B.Strand/A.Bakken 15.07.2015/19.06.2018"}]
[]
[{"$f":"IF(Resultatskj!$C$3=\"\",\"\",Resultatskj!$C$3)","v":""}]
[{"$f":"IF(Resultatskj!$C$4=\"\",\"\",Resultatskj!$C$4)","v":""}]

{"sheet":"8","index":9,"n_rows":53,"n_cols":16,"rows_kept":53,"cut":false,"hidden":false,"merged":[[52,0,52,9],[2,0,2,15],[28,10,28,15],[27,10,27,15],[11,0,11,15],[16,1,16,4],[26,1,26,4],[27,1,27,4],[16,10,16,15],[18,10,18,15],[19,10,19,15],[22,1,22,4],[23,0,23,4],[12,10,12,15],[13,10,13,15],[14,10,14,15],[3,0,3,1],[3,2,3,9],[3,10,3,11],[3,12,3,15],[5,2,5,9],[5,10,5,11],[5,12,5,15],[4,0,4,1],[4,2,4,9],[4,10,4,11],[4,12,4,15],[5,0,5,1],[0,5,0,15],[1,10,1,12],[1,2,1,5],[1,0,1,1],[0,2,0,4],[43,14,43,15],[43,1,43,4],[36,4,36,9],[42,0,42,4],[43,11,43,13],[36,2,36,3],[41,11,41,13],[41,0,41,3],[41,4,41,9],[37,11,37,13],[39,11,39,13],[38,11,38,13],[40,4,40,9],[39,4,39,9],[40,11,40,13],[37,4,37,9],[18,1,18,4],[19,1,19,4],[24,0,24,15],[31,0,31,4],[33,1,33,4],[21,1,21,4],[21,10,21,15],[22,10,22,15],[23,10,23,15],[32,1,32,4],[30,0,30,15],[32,10,32,15],[31,10,31,15],[25,0,25,4],[25,10,25,15],[26,10,26,15],[17,1,17,4],[17,10,17,15],[12,0,12,4],[15,10,15,15],[13,1,13,4],[14,1,14,4],[15,1,15,4],[38,4,38,9],[34,10,34,15],[33,10,33,15],[20,10,20,15],[20,1,20,4],[35,0,35,15],[36,0,36,1],[36,11,36,13],[28,1,28,4],[34,0,34,4],[29,0,29,4],[29,10,29,15],[44,1,44,4],[45,0,45,4],[46,11,46,13],[44,11,44,13],[46,14,46,15],[45,14,45,15],[45,11,45,13],[44,14,44,15],[46,0,48,9],[51,11,51,15],[49,11,49,15],[47,12,47,13],[48,12,48,13],[49,0,49,9],[51,0,51,9]]}
[null,null,null,null,null,{"$f":"'1'!F1:R1","v":"Kl. A - DOMMERPROTOKOLL"}]
[{"$f":"'1'!A2:B2","v":"Dato:"},null,{"$f":"IF(Resultatskj!L2=\"\",\"\",Resultatskj!L2)","v":""},null,null,null,null,null,null,{"$f":"'1'!J2","v":"Gruppe:"},{"$f":"IF(Resultatskj!H4=\"\",\"\",Resultatskj!H4)","v":"Spor"},null,null,null,"Katalog nr.",{"$f":"Resultatskj!B15","v":""}]
[]
[{"$f":"'1'!A4:B4","v":"Arrangør:"},null,{"$f":"IF(Resultatskj!$C$2=\"\",\"\",Resultatskj!$C$2)","v":""},null,null,null,null,null,null,null,{"$f":"'1'!K4:L4","v":"Hundens navn:"}]
[{"$f":"'1'!A5:B5","v":"Fører:"},null,null,null,null,null,null,null,null,null,{"$f":"'1'!K5:L5","v":"Reg.nr.:"}]
[{"$f":"'1'!A6:B6","v":"Klubb:"},null,null,null,null,null,null,null,null,null,{"$f":"'1'!K6:L6","v":"Rase:"}]
[]
[]
[null,"Klasse",null,"Liten",null,null,null,null,null,"Middels",null,null,"Stor"]
[]
[]
[{"$f":"'1'!A12","v":"Lydighet:"}]
[{"$f":"'1'!A13","v":"Øvelser:"},null,null,null,null,"Koeff.","Karakter","Karakter","Snitt","Poeng"]
[{"$f":"'1'!A14","v":1},{"$f":"'1'!B14","v":"Fri ved foten"},null,null,null,3,null,null,{"$f":"IF(G14=\"\",\"\",IF(H14=\"\",\"\",(G14+H14)/2))","v":""},{"$f":"IF(I14=\"\",\"\",IF(I14=0,\"I.G.\",I14*F14))","v":""}]
[{"$f":"'1'!A15","v":2},{"$f":"'1'!B15","v":"Innkalling m/stå og dekk"},null,null,null,3,null,null,{"$f":"IF(G15=\"\",\"\",IF(H15=\"\",\"\",(G15+H15)/2))","v":""},{"$f":"IF(I15=\"\",\"\",IF(I15=0,\"I.G.\",I15*F15))","v":""}]
[{"$f":"'1'!A16","v":3},{"$f":"'1'!B16","v":"Fremadsending"},null,null,null,3,null,null,"",""]
[{"$f":"'1'!A17","v":4},{"$f":"'1'!B17","v":"Kryp"},null,null,null,3,null,null,"",""]
[{"$f":"'1'!A18","v":5},{"$f":"'1'!B18","v":"Hals på kommando"},null,null,null,2,null,null,"",""]
[{"$f":"'1'!A19","v":6},{"$f":"'1'!B19","v":"Apportering metallapport"},null,null,null,3,null,null,"",""]
[{"$f":"'1'!A20","v":7},{"$f":"'1'!B20","v":"Apportering tung gjenstand"},null,null,null,3,null,null,"",""]
[{"$f":"'1'!A21","v":8},"Fritt hopp over hinder",null,null,null,2,null,null,"",""]
[{"$f":"'1'!A22","v":9},{"$f":"'1'!B22","v":"Stigeklatring"},null,null,null,2,null,null,"",""]
[{"$f":"'1'!A23","v":10},{"$f":"'1'!B23","v":"Fellesdekk"},null,null,null,2,null,null,"",""]
[{"$f":"'1'!A24","v":"Sum lydighet:"},null,null,null,null,{"$f":"SUM(F14:F23)","v":26},null,null,null,{"$f":"SUM(J14:J23)","v":0}]
[{"$f":"'1'!A25","v":"Sporgruppen:"}]
[{"$f":"'1'!A26","v":"Øvelser:"},null,null,null,null,"Koeff.","Karakter","Karakter","Snitt","Poeng"]
[{"$f":"'1'!A27","v":11},{"$f":"'1'!B27","v":"Feltsøk"},null,null,null,10,null,null,{"$f":"IF(G27=\"\",\"\",IF(H27=\"\",\"\",(G27+H27)/2))","v":""},{"$f":"IF(I27=\"\",\"\",IF(I27=0,\"I.G.\",I27*F27))","v":""}]
[{"$f":"'1'!A28","v":12},{"$f":"'1'!B28","v":"Sporoppsøk"},null,null,null,5,null,null,{"$f":"IF(G28=\"\",\"\",IF(H28=\"\",\"\",(G28+H28)/2))","v":""},{"$f":"IF(I28=\"\",\"\",IF(I28=0,\"I.G.\",I28*F28))","v":""}]
[{"$f":"'1'!A29","v":13},{"$f":"'1'!B29","v":"Spor"},null,null,null,24,null,null,"",""]
[{"$f":"'1'!A30","v":"Sum spesialøvelser:"},null,null,null,null,{"$f":"SUM(F27:F29)","v":39},null,null,null,{"$f":"IF(AND(J27=\"\",J28=\"\",J29=\"\"),\"\",SUM(J27:J29))","v":""}]
[{"$f":"'1'!A31","v":"Runderingsgruppen:"}]
[{"$f":"'1'!A32","v":"Øvelser:"},null,null,null,null,"Koeff.","Karakter","Karakter","Snitt","Poeng"]
[{"$f":"'1'!A33","v":11},{"$f":"'1'!B33","v":"Feltsøk"},null,null,null,10,null,null,{"$f":"IF(G33=\"\",\"\",IF(H33=\"\",\"\",(G33+H33)/2))","v":""},{"$f":"IF(I33=\"\",\"\",IF(I33=0,\"I.G.\",I33*F33))","v":""}]
[{"$f":"'1'!A34","v":12},{"$f":"'1'!B34","v":"Rundering"},null,null,null,{"$f":"'1'!F34","v":29},null,null,{"$f":"IF(G34=\"\",\"\",IF(H34=\"\",\"\",(G34+H34)/2))","v":""},{"$f":"IF(I34=\"\",\"\",IF(I34=0,\"I.G.\",I34*F34))","v":""}]
[{"$f":"'1'!A35","v":"Sum spesialøvelser:"},null,null,null,null,{"$f":"SUM(F33:F34)","v":39},null,null,null,{"$f":"IF(AND(J33=\"\",J34=\"\"),\"\",SUM(J33:J34))","v":""},null,"Godkjent",null,null,300,"poeng"]
[{"$f":"'1'!A36","v":"Rapportgruppen:"}]
[{"$f":"'1'!A37","v":"Start kl.:"},0,{"$f":"'1'!C37","v":"Ankomst kl.:"},0,{"$f":"'1'!E37:J37","v":"Anvendt tid:"},null,null,null,null,null,null,{"$f":"'1'!L37:N37","v":"Godkjent"},null,null,{"$f":"'1'!O37","v":325},{"$f":"'1'!P37","v":"poeng"}]
[{"$f":"'1'!A38","v":"B"},"00:00:00",{"$f":"'1'!C38","v":"A"},"00:00:00",{"$f":"SUM(B38,D38)","v":"00:00:00"},null,null,null,null,null,null,{"$f":"'1'!L38:N38","v":"- Derav i spesialøvelsene"},null,null,195,{"$f":"'1'!P38","v":"poeng"}]
[{"$f":"'1'!A39","v":"A"},"00:00:00",{"$f":"'1'!C39","v":"B"},"00:00:00",{"$f":"SUM(B39,D39)","v":"00:00:00"},null,null,null,null,null,null,"- Derav i lydighetsøvelsene",null,null,130,{"$f":"'1'!P39","v":"poeng"}]
[{"$f":"'1'!A40","v":"C"},"00:00:00",{"$f":"'1'!C40","v":"A"},"00:00:00",{"$f":"SUM(B40,D40)","v":"00:00:00"},null,null,null,null,null,null,{"$f":"'1'!L40:N40","v":"Cert/CACIT"},null,null,575,{"$f":"'1'!P40","v":"poeng"}]
[{"$f":"'1'!A41","v":"A"},"00:00:00",{"$f":"'1'!C41","v":"D"},"00:00:00",{"$f":"SUM(E37:J40)","v":"00:00:00"},null,null,null,null,null,null,{"$f":"'1'!L41:N41","v":"- Derav i spesialøvelsene"},null,null,312,{"$f":"'1'!P41","v":"poeng"}]
[{"$f":"'1'!A42","v":"Anvendt tid totalt:"},null,null,null,{"$f":"SUM(E38:J41)","v":"00:00:00"},null,null,null,null,null,null,{"$f":"'1'!L42:N42","v":"- Derav i lydighetsøvelsene"},null,null,208,{"$f":"'1'!P42","v":"poeng"}]
[{"$f":"'1'!A43","v":"Øvelser:"},null,null,null,null,{"$f":"'1'!F43","v":"Koeff."},{"$f":"'1'!G43","v":"Karakter"},{"$f":"'1'!H43","v":"Karakter"},"Snitt",{"$f":"'1'!J43","v":"Poeng"}]
[{"$f":"'1'!A44","v":11},{"$f":"'1'!B44","v":"Feltsøk"},null,null,null,10,null,null,{"$f":"IF(G44=\"\",\"\",IF(H44=\"\",\"\",(G44+H44)/2))","v":""},{"$f":"IF(I44=\"\",\"\",IF(I44=0,\"I.G.\",I44*F44))","v":""},null,null,null,null,{"$f":"'1'!O44:P44","v":"Poeng"}]
[{"$f":"'1'!A45","v":12},{"$f":"'1'!B45","v":"Rapport"},null,null,null,{"$f":"'1'!F45","v":29},null,null,{"$f":"IF(G45=\"\",\"\",IF(H45=\"\",\"\",(G45+H45)/2))","v":""},{"$f":"IF(I45=\"\",\"\",IF(I45=0,\"I.G.\",I45*F45))","v":""},null,{"$f":"'1'!L45:N45","v":"Sum Lydighet"},null,null,{"$f":"J24","v":0}]
[{"$f":"'1'!A46","v":"Sum spesialøvelser:"},null,null,null,null,{"$f":"SUM(F44:F45)","v":39},null,null,null,null,null,{"$f":"'1'!L46:N46","v":"Sum Spesialøvelser"},null,null,{"$f":"IF(Resultatskj!H4=\"Rundering\",J35,IF(Resultatskj!H4=\"Spor\",J30,IF(Resultatskj!H4=\"Rapport\",J46,\"\")))","v":""}]
[null,null,null,null,null,null,null,null,null,null,null,{"$f":"'1'!L47:N47","v":"Totalpoeng"},null,null,{"$f":"SUM(O45:P46)","v":0}]
[null,null,null,null,null,null,null,null,null,null,null,{"$f":"'1'!L48","v":"Ikke godkj."},{"$f":"'1'!M48","v":"Godkj."},null,{"$f":"'1'!O48","v":"Cert"},{"$f":"'1'!P48","v":"Plass"}]
[{"$f":"IF(Resultatskj!C3=\"\",\"\",Resultatskj!C3)","v":""},null,null,null,null,{"$f":"IF(Resultatskj!C4=\"\",\"\",Resultatskj!C4)","v":""},null,null,null,null,null,{"$f":"IF(OR(O47<O37,O46<O38,O45<O39,O47=\"\"),\"X\",\"\")","v":"X"},{"$f":"IF(AND(O47>=O37,O46>=O38,O45>=O39,L49=\"\"),\"X\",\"\")","v":""},null,{"$f":"IF(AND(O47>=575,O46>=311.99,O45>207.99,L49=\"\"),\"X\",\"\")","v":""},{"$f":"Resultatskj!A15","v":"-"}]
["Underskrift dommere",null,null,null,null,null,null,null,null,null,null,{"$f":"Resultatskj!K26","v":"B.Strand/A.Bakken 15.07.2015/19.06.2018"}]
[]
[{"$f":"IF(Resultatskj!$C$3=\"\",\"\",Resultatskj!$C$3)","v":""}]
[{"$f":"IF(Resultatskj!$C$4=\"\",\"\",Resultatskj!$C$4)","v":""}]

{"sheet":"9","index":10,"n_rows":53,"n_cols":16,"rows_kept":53,"cut":false,"hidden":false,"merged":[[52,0,52,9],[18,10,18,15],[20,1,20,4],[17,10,17,15],[19,10,19,15],[32,1,32,4],[25,10,25,15],[26,10,26,15],[32,10,32,15],[27,10,27,15],[31,10,31,15],[20,10,20,15],[22,10,22,15],[23,10,23,15],[24,0,24,15],[21,10,21,15],[0,5,0,15],[28,10,28,15],[45,11,45,13],[3,2,3,9],[38,4,38,9],[40,11,40,13],[39,11,39,13],[39,4,39,9],[33,10,33,15],[3,12,3,15],[16,10,16,15],[11,0,11,15],[16,1,16,4],[3,0,3,1],[3,10,3,11],[17,1,17,4],[1,0,1,1],[1,2,1,5],[1,10,1,12],[2,0,2,15],[4,10,4,11],[4,0,4,1],[4,2,4,9],[4,12,4,15],[5,0,5,1],[5,2,5,9],[5,10,5,11],[5,12,5,15],[15,1,15,4],[15,10,15,15],[14,10,14,15],[12,0,12,4],[12,10,12,15],[13,1,13,4],[13,10,13,15],[35,0,35,15],[36,0,36,1],[36,2,36,3],[41,0,41,3],[41,4,41,9],[37,11,37,13],[37,4,37,9],[40,4,40,9],[34,10,34,15],[29,10,29,15],[30,0,30,15],[31,0,31,4],[33,1,33,4],[34,0,34,4],[25,0,25,4],[28,1,28,4],[29,0,29,4],[18,1,18,4],[19,1,19,4],[26,1,26,4],[27,1,27,4],[22,1,22,4],[23,0,23,4],[21,1,21,4],[0,2,0,4],[44,14,44,15],[44,11,44,13],[47,12,47,13],[48,12,48,13],[36,4,36,9],[36,11,36,13],[46,0,48,9],[46,11,46,13],[46,14,46,15],[45,14,45,15],[42,0,42,4],[43,11,43,13],[43,14,43,15],[43,1,43,4],[14,1,14,4],[51,11,51,15],[49,11,49,15],[38,11,38,13],[44,1,44,4],[45,0,45,4],[49,0,49,9],[41,11,41,13],[51,0,51,9]]}
[null,null,null,null,null,{"$f":"'1'!F1:R1","v":"Kl. A - DOMMERPROTOKOLL"}]
[{"$f":"'1'!A2:B2","v":"Dato:"},null,{"$f":"IF(Resultatskj!L2=\"\",\"\",Resultatskj!L2)","v":""},null,null,null,null,null,null,{"$f":"'1'!J2","v":"Gruppe:"},{"$f":"IF(Resultatskj!H4=\"\",\"\",Resultatskj!H4)","v":"Spor"},null,null,null,"Katalog nr.",{"$f":"Resultatskj!B16","v":""}]
[]
[{"$f":"'1'!A4:B4","v":"Arrangør:"},null,{"$f":"IF(Resultatskj!$C$2=\"\",\"\",Resultatskj!$C$2)","v":""},null,null,null,null,null,null,null,{"$f":"'1'!K4:L4","v":"Hundens navn:"}]
[{"$f":"'1'!A5:B5","v":"Fører:"},null,null,null,null,null,null,null,null,null,{"$f":"'1'!K5:L5","v":"Reg.nr.:"}]
[{"$f":"'1'!A6:B6","v":"Klubb:"},null,null,null,null,null,null,null,null,null,{"$f":"'1'!K6:L6","v":"Rase:"}]
[]
[]
[null,"Klasse",null,"Liten",null,null,null,null,null,"Middels",null,null,"Stor"]
[]
[]
[{"$f":"'1'!A12","v":"Lydighet:"}]
[{"$f":"'1'!A13","v":"Øvelser:"},null,null,null,null,"Koeff.","Karakter","Karakter","Snitt","Poeng"]
[{"$f":"'1'!A14","v":1},{"$f":"'1'!B14","v":"Fri ved foten"},null,null,null,3,null,null,{"$f":"IF(G14=\"\",\"\",IF(H14=\"\",\"\",(G14+H14)/2))","v":""},{"$f":"IF(I14=\"\",\"\",IF(I14=0,\"I.G.\",I14*F14))","v":""}]
[{"$f":"'1'!A15","v":2},{"$f":"'1'!B15","v":"Innkalling m/stå og dekk"},null,null,null,3,null,null,{"$f":"IF(G15=\"\",\"\",IF(H15=\"\",\"\",(G15+H15)/2))","v":""},{"$f":"IF(I15=\"\",\"\",IF(I15=0,\"I.G.\",I15*F15))","v":""}]
[{"$f":"'1'!A16","v":3},{"$f":"'1'!B16","v":"Fremadsending"},null,null,null,3,null,null,"",""]
[{"$f":"'1'!A17","v":4},{"$f":"'1'!B17","v":"Kryp"},null,null,null,3,null,null,"",""]
[{"$f":"'1'!A18","v":5},{"$f":"'1'!B18","v":"Hals på kommando"},null,null,null,2,null,null,"",""]
[{"$f":"'1'!A19","v":6},{"$f":"'1'!B19","v":"Apportering metallapport"},null,null,null,3,null,null,"",""]
[{"$f":"'1'!A20","v":7},{"$f":"'1'!B20","v":"Apportering tung gjenstand"},null,null,null,3,null,null,"",""]
[{"$f":"'1'!A21","v":8},"Fritt hopp over hinder",null,null,null,2,null,null,"",""]
[{"$f":"'1'!A22","v":9},{"$f":"'1'!B22","v":"Stigeklatring"},null,null,null,2,null,null,"",""]
[{"$f":"'1'!A23","v":10},{"$f":"'1'!B23","v":"Fellesdekk"},null,null,null,2,null,null,"",""]
[{"$f":"'1'!A24","v":"Sum lydighet:"},null,null,null,null,{"$f":"SUM(F14:F23)","v":26},null,null,null,{"$f":"SUM(J14:J23)","v":0}]
[{"$f":"'1'!A25","v":"Sporgruppen:"}]
[{"$f":"'1'!A26","v":"Øvelser:"},null,null,null,null,"Koeff.","Karakter","Karakter","Snitt","Poeng"]
[{"$f":"'1'!A27","v":11},{"$f":"'1'!B27","v":"Feltsøk"},null,null,null,10,null,null,{"$f":"IF(G27=\"\",\"\",IF(H27=\"\",\"\",(G27+H27)/2))","v":""},{"$f":"IF(I27=\"\",\"\",IF(I27=0,\"I.G.\",I27*F27))","v":""}]
[{"$f":"'1'!A28","v":12},{"$f":"'1'!B28","v":"Sporoppsøk"},null,null,null,5,null,null,{"$f":"IF(G28=\"\",\"\",IF(H28=\"\",\"\",(G28+H28)/2))","v":""},{"$f":"IF(I28=\"\",\"\",IF(I28=0,\"I.G.\",I28*F28))","v":""}]
[{"$f":"'1'!A29","v":13},{"$f":"'1'!B29","v":"Spor"},null,null,null,24,null,null,"",""]
[{"$f":"'1'!A30","v":"Sum spesialøvelser:"},null,null,null,null,{"$f":"SUM(F27:F29)","v":39},null,null,null,{"$f":"IF(AND(J27=\"\",J28=\"\",J29=\"\"),\"\",SUM(J27:J29))","v":""}]
[{"$f":"'1'!A31","v":"Runderingsgruppen:"}]
[{"$f":"'1'!A32","v":"Øvelser:"},null,null,null,null,"Koeff.","Karakter","Karakter","Snitt","Poeng"]
[{"$f":"'1'!A33","v":11},{"$f":"'1'!B33","v":"Feltsøk"},null,null,null,10,null,null,{"$f":"IF(G33=\"\",\"\",IF(H33=\"\",\"\",(G33+H33)/2))","v":""},{"$f":"IF(I33=\"\",\"\",IF(I33=0,\"I.G.\",I33*F33))","v":""}]
[{"$f":"'1'!A34","v":12},{"$f":"'1'!B34","v":"Rundering"},null,null,null,{"$f":"'1'!F34","v":29},null,null,{"$f":"IF(G34=\"\",\"\",IF(H34=\"\",\"\",(G34+H34)/2))","v":""},{"$f":"IF(I34=\"\",\"\",IF(I34=0,\"I.G.\",I34*F34))","v":""}]
[{"$f":"'1'!A35","v":"Sum spesialøvelser:"},null,null,null,null,{"$f":"SUM(F33:F34)","v":39},null,null,null,{"$f":"IF(AND(J33=\"\",J34=\"\"),\"\",SUM(J33:J34))","v":""},null,"Godkjent",null,null,300,"poeng"]
[{"$f":"'1'!A36","v":"Rapportgruppen:"}]
[{"$f":"'1'!A37","v":"Start kl.:"},0,{"$f":"'1'!C37","v":"Ankomst kl.:"},0,{"$f":"'1'!E37:J37","v":"Anvendt tid:"},null,null,null,null,null,null,{"$f":"'1'!L37:N37","v":"Godkjent"},null,null,{"$f":"'1'!O37","v":325},{"$f":"'1'!P37","v":"poeng"}]
[{"$f":"'1'!A38","v":"B"},"00:00:00",{"$f":"'1'!C38","v":"A"},"00:00:00",{"$f":"SUM(B38,D38)","v":"00:00:00"},null,null,null,null,null,null,{"$f":"'1'!L38:N38","v":"- Derav i spesialøvelsene"},null,null,195,{"$f":"'1'!P38","v":"poeng"}]
[{"$f":"'1'!A39","v":"A"},"00:00:00",{"$f":"'1'!C39","v":"B"},"00:00:00",{"$f":"SUM(B39,D39)","v":"00:00:00"},null,null,null,null,null,null,"- Derav i lydighetsøvelsene",null,null,130,{"$f":"'1'!P39","v":"poeng"}]
[{"$f":"'1'!A40","v":"C"},"00:00:00",{"$f":"'1'!C40","v":"A"},"00:00:00",{"$f":"SUM(B40,D40)","v":"00:00:00"},null,null,null,null,null,null,{"$f":"'1'!L40:N40","v":"Cert/CACIT"},null,null,575,{"$f":"'1'!P40","v":"poeng"}]
[{"$f":"'1'!A41","v":"A"},"00:00:00",{"$f":"'1'!C41","v":"D"},"00:00:00",{"$f":"SUM(E37:J40)","v":"00:00:00"},null,null,null,null,null,null,{"$f":"'1'!L41:N41","v":"- Derav i spesialøvelsene"},null,null,312,{"$f":"'1'!P41","v":"poeng"}]
[{"$f":"'1'!A42","v":"Anvendt tid totalt:"},null,null,null,{"$f":"SUM(E38:J41)","v":"00:00:00"},null,null,null,null,null,null,{"$f":"'1'!L42:N42","v":"- Derav i lydighetsøvelsene"},null,null,208,{"$f":"'1'!P42","v":"poeng"}]
[{"$f":"'1'!A43","v":"Øvelser:"},null,null,null,null,{"$f":"'1'!F43","v":"Koeff."},{"$f":"'1'!G43","v":"Karakter"},{"$f":"'1'!H43","v":"Karakter"},"Snitt",{"$f":"'1'!J43","v":"Poeng"}]
[{"$f":"'1'!A44","v":11},{"$f":"'1'!B44","v":"Feltsøk"},null,null,null,10,null,null,{"$f":"IF(G44=\"\",\"\",IF(H44=\"\",\"\",(G44+H44)/2))","v":""},{"$f":"IF(I44=\"\",\"\",IF(I44=0,\"I.G.\",I44*F44))","v":""},null,null,null,null,{"$f":"'1'!O44:P44","v":"Poeng"}]
[{"$f":"'1'!A45","v":12},{"$f":"'1'!B45","v":"Rapport"},null,null,null,{"$f":"'1'!F45","v":29},null,null,{"$f":"IF(G45=\"\",\"\",IF(H45=\"\",\"\",(G45+H45)/2))","v":""},{"$f":"IF(I45=\"\",\"\",IF(I45=0,\"I.G.\",I45*F45))","v":""},null,{"$f":"'1'!L45:N45","v":"Sum Lydighet"},null,null,{"$f":"J24","v":0}]
[{"$f":"'1'!A46","v":"Sum spesialøvelser:"},null,null,null,null,{"$f":"SUM(F44:F45)","v":39},null,null,null,null,null,{"$f":"'1'!L46:N46","v":"Sum Spesialøvelser"},null,null,{"$f":"IF(Resultatskj!H4=\"Rundering\",J35,IF(Resultatskj!H4=\"Spor\",J30,IF(Resultatskj!H4=\"Rapport\",J46,\"\")))","v":""}]
[null,null,null,null,null,null,null,null,null,null,null,{"$f":"'1'!L47:N47","v":"Totalpoeng"},null,null,{"$f":"SUM(O45:P46)","v":0}]
[null,null,null,null,null,null,null,null,null,null,null,{"$f":"'1'!L48","v":"Ikke godkj."},{"$f":"'1'!M48","v":"Godkj."},null,{"$f":"'1'!O48","v":"Cert"},{"$f":"'1'!P48","v":"Plass"}]
[{"$f":"IF(Resultatskj!C3=\"\",\"\",Resultatskj!C3)","v":""},null,null,null,null,{"$f":"IF(Resultatskj!C4=\"\",\"\",Resultatskj!C4)","v":""},null,null,null,null,null,{"$f":"IF(OR(O47<O37,O46<O38,O45<O39,O47=\"\"),\"X\",\"\")","v":"X"},{"$f":"IF(AND(O47>=O37,O46>=O38,O45>=O39,L49=\"\"),\"X\",\"\")","v":""},null,{"$f":"IF(AND(O47>=575,O46>=311.99,O45>207.99,L49=\"\"),\"X\",\"\")","v":""},{"$f":"Resultatskj!A16","v":"-"}]
["Underskrift dommere",null,null,null,null,null,null,null,null,null,null,{"$f":"Resultatskj!K26","v":"B.Strand/A.Bakken 15.07.2015/19.06.2018"}]
[]
[{"$f":"IF(Resultatskj!$C$3=\"\",\"\",Resultatskj!$C$3)","v":""}]
[{"$f":"IF(Resultatskj!$C$4=\"\",\"\",Resultatskj!$C$4)","v":""}]

{"sheet":"10","index":11,"n_rows":53,"n_cols":16,"rows_kept":53,"cut":false,"hidden":false,"merged":[[52,0,52,9],[2,0,2,15],[28,10,28,15],[27,10,27,15],[11,0,11,15],[16,1,16,4],[26,1,26,4],[27,1,27,4],[16,10,16,15],[18,10,18,15],[19,10,19,15],[22,1,22,4],[23,0,23,4],[12,10,12,15],[13,10,13,15],[14,10,14,15],[3,0,3,1],[3,2,3,9],[3,10,3,11],[3,12,3,15],[5,2,5,9],[5,10,5,11],[5,12,5,15],[4,0,4,1],[4,2,4,9],[4,10,4,11],[4,12,4,15],[5,0,5,1],[0,5,0,15],[1,10,1,12],[1,2,1,5],[1,0,1,1],[0,2,0,4],[43,14,43,15],[43,1,43,4],[36,4,36,9],[42,0,42,4],[43,11,43,13],[36,2,36,3],[41,11,41,13],[41,0,41,3],[41,4,41,9],[37,11,37,13],[39,11,39,13],[38,11,38,13],[40,4,40,9],[39,4,39,9],[40,11,40,13],[37,4,37,9],[18,1,18,4],[19,1,19,4],[24,0,24,15],[31,0,31,4],[33,1,33,4],[21,1,21,4],[21,10,21,15],[22,10,22,15],[23,10,23,15],[32,1,32,4],[30,0,30,15],[32,10,32,15],[31,10,31,15],[25,0,25,4],[25,10,25,15],[26,10,26,15],[17,1,17,4],[17,10,17,15],[12,0,12,4],[15,10,15,15],[13,1,13,4],[14,1,14,4],[15,1,15,4],[38,4,38,9],[34,10,34,15],[33,10,33,15],[20,10,20,15],[20,1,20,4],[35,0,35,15],[36,0,36,1],[36,11,36,13],[28,1,28,4],[34,0,34,4],[29,0,29,4],[29,10,29,15],[44,1,44,4],[45,0,45,4],[46,11,46,13],[44,11,44,13],[46,14,46,15],[45,14,45,15],[45,11,45,13],[44,14,44,15],[46,0,48,9],[51,11,51,15],[49,11,49,15],[47,12,47,13],[48,12,48,13],[49,0,49,9],[51,0,51,9]]}
[null,null,null,null,null,{"$f":"'1'!F1:R1","v":"Kl. A - DOMMERPROTOKOLL"}]
[{"$f":"'1'!A2:B2","v":"Dato:"},null,{"$f":"IF(Resultatskj!L2=\"\",\"\",Resultatskj!L2)","v":""},null,null,null,null,null,null,{"$f":"'1'!J2","v":"Gruppe:"},{"$f":"IF(Resultatskj!H4=\"\",\"\",Resultatskj!H4)","v":"Spor"},null,null,null,"Katalog nr.",{"$f":"Resultatskj!B17","v":""}]
[]
[{"$f":"'1'!A4:B4","v":"Arrangør:"},null,{"$f":"IF(Resultatskj!$C$2=\"\",\"\",Resultatskj!$C$2)","v":""},null,null,null,null,null,null,null,{"$f":"'1'!K4:L4","v":"Hundens navn:"}]
[{"$f":"'1'!A5:B5","v":"Fører:"},null,null,null,null,null,null,null,null,null,{"$f":"'1'!K5:L5","v":"Reg.nr.:"}]
[{"$f":"'1'!A6:B6","v":"Klubb:"},null,null,null,null,null,null,null,null,null,{"$f":"'1'!K6:L6","v":"Rase:"}]
[]
[]
[null,"Klasse",null,"Liten",null,null,null,null,null,"Middels",null,null,"Stor"]
[]
[]
[{"$f":"'1'!A12","v":"Lydighet:"}]
[{"$f":"'1'!A13","v":"Øvelser:"},null,null,null,null,"Koeff.","Karakter","Karakter","Snitt","Poeng"]
[{"$f":"'1'!A14","v":1},{"$f":"'1'!B14","v":"Fri ved foten"},null,null,null,3,null,null,{"$f":"IF(G14=\"\",\"\",IF(H14=\"\",\"\",(G14+H14)/2))","v":""},{"$f":"IF(I14=\"\",\"\",IF(I14=0,\"I.G.\",I14*F14))","v":""}]
[{"$f":"'1'!A15","v":2},{"$f":"'1'!B15","v":"Innkalling m/stå og dekk"},null,null,null,3,null,null,{"$f":"IF(G15=\"\",\"\",IF(H15=\"\",\"\",(G15+H15)/2))","v":""},{"$f":"IF(I15=\"\",\"\",IF(I15=0,\"I.G.\",I15*F15))","v":""}]
[{"$f":"'1'!A16","v":3},{"$f":"'1'!B16","v":"Fremadsending"},null,null,null,3,null,null,"",""]
[{"$f":"'1'!A17","v":4},{"$f":"'1'!B17","v":"Kryp"},null,null,null,3,null,null,"",""]
[{"$f":"'1'!A18","v":5},{"$f":"'1'!B18","v":"Hals på kommando"},null,null,null,2,null,null,"",""]
[{"$f":"'1'!A19","v":6},{"$f":"'1'!B19","v":"Apportering metallapport"},null,null,null,3,null,null,"",""]
[{"$f":"'1'!A20","v":7},{"$f":"'1'!B20","v":"Apportering tung gjenstand"},null,null,null,3,null,null,"",""]
[{"$f":"'1'!A21","v":8},"Fritt hopp over hinder",null,null,null,2,null,null,"",""]
[{"$f":"'1'!A22","v":9},{"$f":"'1'!B22","v":"Stigeklatring"},null,null,null,2,null,null,"",""]
[{"$f":"'1'!A23","v":10},{"$f":"'1'!B23","v":"Fellesdekk"},null,null,null,2,null,null,"",""]
[{"$f":"'1'!A24","v":"Sum lydighet:"},null,null,null,null,{"$f":"SUM(F14:F23)","v":26},null,null,null,{"$f":"SUM(J14:J23)","v":0}]
[{"$f":"'1'!A25","v":"Sporgruppen:"}]
[{"$f":"'1'!A26","v":"Øvelser:"},null,null,null,null,"Koeff.","Karakter","Karakter","Snitt","Poeng"]
[{"$f":"'1'!A27","v":11},{"$f":"'1'!B27","v":"Feltsøk"},null,null,null,10,null,null,{"$f":"IF(G27=\"\",\"\",IF(H27=\"\",\"\",(G27+H27)/2))","v":""},{"$f":"IF(I27=\"\",\"\",IF(I27=0,\"I.G.\",I27*F27))","v":""}]
[{"$f":"'1'!A28","v":12},{"$f":"'1'!B28","v":"Sporoppsøk"},null,null,null,5,null,null,{"$f":"IF(G28=\"\",\"\",IF(H28=\"\",\"\",(G28+H28)/2))","v":""},{"$f":"IF(I28=\"\",\"\",IF(I28=0,\"I.G.\",I28*F28))","v":""}]
[{"$f":"'1'!A29","v":13},{"$f":"'1'!B29","v":"Spor"},null,null,null,24,null,null,"",""]
[{"$f":"'1'!A30","v":"Sum spesialøvelser:"},null,null,null,null,{"$f":"SUM(F27:F29)","v":39},null,null,null,{"$f":"IF(AND(J27=\"\",J28=\"\",J29=\"\"),\"\",SUM(J27:J29))","v":""}]
[{"$f":"'1'!A31","v":"Runderingsgruppen:"}]
[{"$f":"'1'!A32","v":"Øvelser:"},null,null,null,null,"Koeff.","Karakter","Karakter","Snitt","Poeng"]
[{"$f":"'1'!A33","v":11},{"$f":"'1'!B33","v":"Feltsøk"},null,null,null,10,null,null,{"$f":"IF(G33=\"\",\"\",IF(H33=\"\",\"\",(G33+H33)/2))","v":""},{"$f":"IF(I33=\"\",\"\",IF(I33=0,\"I.G.\",I33*F33))","v":""}]
[{"$f":"'1'!A34","v":12},{"$f":"'1'!B34","v":"Rundering"},null,null,null,{"$f":"'1'!F34","v":29},null,null,{"$f":"IF(G34=\"\",\"\",IF(H34=\"\",\"\",(G34+H34)/2))","v":""},{"$f":"IF(I34=\"\",\"\",IF(I34=0,\"I.G.\",I34*F34))","v":""}]
[{"$f":"'1'!A35","v":"Sum spesialøvelser:"},null,null,null,null,{"$f":"SUM(F33:F34)","v":39},null,null,null,{"$f":"IF(AND(J33=\"\",J34=\"\"),\"\",SUM(J33:J34))","v":""},null,"Godkjent",null,null,300,"poeng"]
[{"$f":"'1'!A36","v":"Rapportgruppen:"}]
[{"$f":"'1'!A37","v":"Start kl.:"},0,{"$f":"'1'!C37","v":"Ankomst kl.:"},0,{"$f":"'1'!E37:J37","v":"Anvendt tid:"},null,null,null,null,null,null,{"$f":"'1'!L37:N37","v":"Godkjent"},null,null,{"$f":"'1'!O37","v":325},{"$f":"'1'!P37","v":"poeng"}]
[{"$f":"'1'!A38","v":"B"},"00:00:00",{"$f":"'1'!C38","v":"A"},"00:00:00",{"$f":"SUM(B38,D38)","v":"00:00:00"},null,null,null,null,null,null,{"$f":"'1'!L38:N38","v":"- Derav i spesialøvelsene"},null,null,195,{"$f":"'1'!P38","v":"poeng"}]
[{"$f":"'1'!A39","v":"A"},"00:00:00",{"$f":"'1'!C39","v":"B"},"00:00:00",{"$f":"SUM(B39,D39)","v":"00:00:00"},null,null,null,null,null,null,"- Derav i lydighetsøvelsene",null,null,130,{"$f":"'1'!P39","v":"poeng"}]
[{"$f":"'1'!A40","v":"C"},"00:00:00",{"$f":"'1'!C40","v":"A"},"00:00:00",{"$f":"SUM(B40,D40)","v":"00:00:00"},null,null,null,null,null,null,{"$f":"'1'!L40:N40","v":"Cert/CACIT"},null,null,575,{"$f":"'1'!P40","v":"poeng"}]
[{"$f":"'1'!A41","v":"A"},"00:00:00",{"$f":"'1'!C41","v":"D"},"00:00:00",{"$f":"SUM(E37:J40)","v":"00:00:00"},null,null,null,null,null,null,{"$f":"'1'!L41:N41","v":"- Derav i spesialøvelsene"},null,null,312,{"$f":"'1'!P41","v":"poeng"}]
[{"$f":"'1'!A42","v":"Anvendt tid totalt:"},null,null,null,{"$f":"SUM(E38:J41)","v":"00:00:00"},null,null,null,null,null,null,{"$f":"'1'!L42:N42","v":"- Derav i lydighetsøvelsene"},null,null,208,{"$f":"'1'!P42","v":"poeng"}]
[{"$f":"'1'!A43","v":"Øvelser:"},null,null,null,null,{"$f":"'1'!F43","v":"Koeff."},{"$f":"'1'!G43","v":"Karakter"},{"$f":"'1'!H43","v":"Karakter"},"Snitt",{"$f":"'1'!J43","v":"Poeng"}]
[{"$f":"'1'!A44","v":11},{"$f":"'1'!B44","v":"Feltsøk"},null,null,null,10,null,null,{"$f":"IF(G44=\"\",\"\",IF(H44=\"\",\"\",(G44+H44)/2))","v":""},{"$f":"IF(I44=\"\",\"\",IF(I44=0,\"I.G.\",I44*F44))","v":""},null,null,null,null,{"$f":"'1'!O44:P44","v":"Poeng"}]
[{"$f":"'1'!A45","v":12},{"$f":"'1'!B45","v":"Rapport"},null,null,null,{"$f":"'1'!F45","v":29},null,null,{"$f":"IF(G45=\"\",\"\",IF(H45=\"\",\"\",(G45+H45)/2))","v":""},{"$f":"IF(I45=\"\",\"\",IF(I45=0,\"I.G.\",I45*F45))","v":""},null,{"$f":"'1'!L45:N45","v":"Sum Lydighet"},null,null,{"$f":"J24","v":0}]
[{"$f":"'1'!A46","v":"Sum spesialøvelser:"},null,null,null,null,{"$f":"SUM(F44:F45)","v":39},null,null,null,null,null,{"$f":"'1'!L46:N46","v":"Sum Spesialøvelser"},null,null,{"$f":"IF(Resultatskj!H4=\"Rundering\",J35,IF(Resultatskj!H4=\"Spor\",J30,IF(Resultatskj!H4=\"Rapport\",J46,\"\")))","v":""}]
[null,null,null,null,null,null,null,null,null,null,null,{"$f":"'1'!L47:N47","v":"Totalpoeng"},null,null,{"$f":"SUM(O45:P46)","v":0}]
[null,null,null,null,null,null,null,null,null,null,null,{"$f":"'1'!L48","v":"Ikke godkj."},{"$f":"'1'!M48","v":"Godkj."},null,{"$f":"'1'!O48","v":"Cert"},{"$f":"'1'!P48","v":"Plass"}]
[{"$f":"IF(Resultatskj!C3=\"\",\"\",Resultatskj!C3)","v":""},null,null,null,null,{"$f":"IF(Resultatskj!C4=\"\",\"\",Resultatskj!C4)","v":""},null,null,null,null,null,{"$f":"IF(OR(O47<O37,O46<O38,O45<O39,O47=\"\"),\"X\",\"\")","v":"X"},{"$f":"IF(AND(O47>=O37,O46>=O38,O45>=O39,L49=\"\"),\"X\",\"\")","v":""},null,{"$f":"IF(AND(O47>=575,O46>=311.99,O45>207.99,L49=\"\"),\"X\",\"\")","v":""},{"$f":"Resultatskj!A17","v":"-"}]
["Underskrift dommere",null,null,null,null,null,null,null,null,null,null,{"$f":"Resultatskj!K26","v":"B.Strand/A.Bakken 15.07.2015/19.06.2018"}]
[]
[{"$f":"IF(Resultatskj!$C$3=\"\",\"\",Resultatskj!$C$3)","v":""}]
[{"$f":"IF(Resultatskj!$C$4=\"\",\"\",Resultatskj!$C$4)","v":""}]

{"sheet":"11","index":12,"n_rows":53,"n_cols":16,"rows_kept":53,"cut":false,"hidden":false,"merged":[[52,0,52,9],[18,10,18,15],[20,1,20,4],[17,10,17,15],[19,10,19,15],[32,1,32,4],[25,10,25,15],[26,10,26,15],[32,10,32,15],[27,10,27,15],[31,10,31,15],[20,10,20,15],[22,10,22,15],[23,10,23,15],[24,0,24,15],[21,10,21,15],[0,5,0,15],[28,10,28,15],[45,11,45,13],[3,2,3,9],[38,4,38,9],[40,11,40,13],[39,11,39,13],[39,4,39,9],[33,10,33,15],[3,12,3,15],[16,10,16,15],[11,0,11,15],[16,1,16,4],[3,0,3,1],[3,10,3,11],[17,1,17,4],[1,0,1,1],[1,2,1,5],[1,10,1,12],[2,0,2,15],[4,10,4,11],[4,0,4,1],[4,2,4,9],[4,12,4,15],[5,0,5,1],[5,2,5,9],[5,10,5,11],[5,12,5,15],[15,1,15,4],[15,10,15,15],[14,10,14,15],[12,0,12,4],[12,10,12,15],[13,1,13,4],[13,10,13,15],[35,0,35,15],[36,0,36,1],[36,2,36,3],[41,0,41,3],[41,4,41,9],[37,11,37,13],[37,4,37,9],[40,4,40,9],[34,10,34,15],[29,10,29,15],[30,0,30,15],[31,0,31,4],[33,1,33,4],[34,0,34,4],[25,0,25,4],[28,1,28,4],[29,0,29,4],[18,1,18,4],[19,1,19,4],[26,1,26,4],[27,1,27,4],[22,1,22,4],[23,0,23,4],[21,1,21,4],[0,2,0,4],[44,14,44,15],[44,11,44,13],[47,12,47,13],[48,12,48,13],[36,4,36,9],[36,11,36,13],[46,0,48,9],[46,11,46,13],[46,14,46,15],[45,14,45,15],[42,0,42,4],[43,11,43,13],[43,14,43,15],[43,1,43,4],[14,1,14,4],[51,11,51,15],[49,11,49,15],[38,11,38,13],[44,1,44,4],[45,0,45,4],[49,0,49,9],[41,11,41,13],[51,0,51,9]]}
[null,null,null,null,null,{"$f":"'1'!F1:R1","v":"Kl. A - DOMMERPROTOKOLL"}]
[{"$f":"'1'!A2:B2","v":"Dato:"},null,{"$f":"IF(Resultatskj!L2=\"\",\"\",Resultatskj!L2)","v":""},null,null,null,null,null,null,{"$f":"'1'!J2","v":"Gruppe:"},{"$f":"IF(Resultatskj!H4=\"\",\"\",Resultatskj!H4)","v":"Spor"},null,null,null,"Katalog nr.",{"$f":"Resultatskj!B18","v":""}]
[]
[{"$f":"'1'!A4:B4","v":"Arrangør:"},null,{"$f":"IF(Resultatskj!$C$2=\"\",\"\",Resultatskj!$C$2)","v":""},null,null,null,null,null,null,null,{"$f":"'1'!K4:L4","v":"Hundens navn:"}]
[{"$f":"'1'!A5:B5","v":"Fører:"},null,null,null,null,null,null,null,null,null,{"$f":"'1'!K5:L5","v":"Reg.nr.:"}]
[{"$f":"'1'!A6:B6","v":"Klubb:"},null,null,null,null,null,null,null,null,null,{"$f":"'1'!K6:L6","v":"Rase:"}]
[]
[]
[null,"Klasse",null,"Liten",null,null,null,null,null,"Middels",null,null,"Stor"]
[]
[]
[{"$f":"'1'!A12","v":"Lydighet:"}]
[{"$f":"'1'!A13","v":"Øvelser:"},null,null,null,null,"Koeff.","Karakter","Karakter","Snitt","Poeng"]
[{"$f":"'1'!A14","v":1},{"$f":"'1'!B14","v":"Fri ved foten"},null,null,null,3,null,null,{"$f":"IF(G14=\"\",\"\",IF(H14=\"\",\"\",(G14+H14)/2))","v":""},{"$f":"IF(I14=\"\",\"\",IF(I14=0,\"I.G.\",I14*F14))","v":""}]
[{"$f":"'1'!A15","v":2},{"$f":"'1'!B15","v":"Innkalling m/stå og dekk"},null,null,null,3,null,null,{"$f":"IF(G15=\"\",\"\",IF(H15=\"\",\"\",(G15+H15)/2))","v":""},{"$f":"IF(I15=\"\",\"\",IF(I15=0,\"I.G.\",I15*F15))","v":""}]
[{"$f":"'1'!A16","v":3},{"$f":"'1'!B16","v":"Fremadsending"},null,null,null,3,null,null,"",""]
[{"$f":"'1'!A17","v":4},{"$f":"'1'!B17","v":"Kryp"},null,null,null,3,null,null,"",""]
[{"$f":"'1'!A18","v":5},{"$f":"'1'!B18","v":"Hals på kommando"},null,null,null,2,null,null,"",""]
[{"$f":"'1'!A19","v":6},{"$f":"'1'!B19","v":"Apportering metallapport"},null,null,null,3,null,null,"",""]
[{"$f":"'1'!A20","v":7},{"$f":"'1'!B20","v":"Apportering tung gjenstand"},null,null,null,3,null,null,"",""]
[{"$f":"'1'!A21","v":8},"Fritt hopp over hinder",null,null,null,2,null,null,"",""]
[{"$f":"'1'!A22","v":9},{"$f":"'1'!B22","v":"Stigeklatring"},null,null,null,2,null,null,"",""]
[{"$f":"'1'!A23","v":10},{"$f":"'1'!B23","v":"Fellesdekk"},null,null,null,2,null,null,"",""]
[{"$f":"'1'!A24","v":"Sum lydighet:"},null,null,null,null,{"$f":"SUM(F14:F23)","v":26},null,null,null,{"$f":"SUM(J14:J23)","v":0}]
[{"$f":"'1'!A25","v":"Sporgruppen:"}]
[{"$f":"'1'!A26","v":"Øvelser:"},null,null,null,null,"Koeff.","Karakter","Karakter","Snitt","Poeng"]
[{"$f":"'1'!A27","v":11},{"$f":"'1'!B27","v":"Feltsøk"},null,null,null,10,null,null,{"$f":"IF(G27=\"\",\"\",IF(H27=\"\",\"\",(G27+H27)/2))","v":""},{"$f":"IF(I27=\"\",\"\",IF(I27=0,\"I.G.\",I27*F27))","v":""}]
[{"$f":"'1'!A28","v":12},{"$f":"'1'!B28","v":"Sporoppsøk"},null,null,null,5,null,null,{"$f":"IF(G28=\"\",\"\",IF(H28=\"\",\"\",(G28+H28)/2))","v":""},{"$f":"IF(I28=\"\",\"\",IF(I28=0,\"I.G.\",I28*F28))","v":""}]
[{"$f":"'1'!A29","v":13},{"$f":"'1'!B29","v":"Spor"},null,null,null,24,null,null,"",""]
[{"$f":"'1'!A30","v":"Sum spesialøvelser:"},null,null,null,null,{"$f":"SUM(F27:F29)","v":39},null,null,null,{"$f":"IF(AND(J27=\"\",J28=\"\",J29=\"\"),\"\",SUM(J27:J29))","v":""}]
[{"$f":"'1'!A31","v":"Runderingsgruppen:"}]
[{"$f":"'1'!A32","v":"Øvelser:"},null,null,null,null,"Koeff.","Karakter","Karakter","Snitt","Poeng"]
[{"$f":"'1'!A33","v":11},{"$f":"'1'!B33","v":"Feltsøk"},null,null,null,10,null,null,{"$f":"IF(G33=\"\",\"\",IF(H33=\"\",\"\",(G33+H33)/2))","v":""},{"$f":"IF(I33=\"\",\"\",IF(I33=0,\"I.G.\",I33*F33))","v":""}]
[{"$f":"'1'!A34","v":12},{"$f":"'1'!B34","v":"Rundering"},null,null,null,{"$f":"'1'!F34","v":29},null,null,{"$f":"IF(G34=\"\",\"\",IF(H34=\"\",\"\",(G34+H34)/2))","v":""},{"$f":"IF(I34=\"\",\"\",IF(I34=0,\"I.G.\",I34*F34))","v":""}]
[{"$f":"'1'!A35","v":"Sum spesialøvelser:"},null,null,null,null,{"$f":"SUM(F33:F34)","v":39},null,null,null,{"$f":"IF(AND(J33=\"\",J34=\"\"),\"\",SUM(J33:J34))","v":""},null,"Godkjent",null,null,300,"poeng"]
[{"$f":"'1'!A36","v":"Rapportgruppen:"}]
[{"$f":"'1'!A37","v":"Start kl.:"},0,{"$f":"'1'!C37","v":"Ankomst kl.:"},0,{"$f":"'1'!E37:J37","v":"Anvendt tid:"},null,null,null,null,null,null,{"$f":"'1'!L37:N37","v":"Godkjent"},null,null,{"$f":"'1'!O37","v":325},{"$f":"'1'!P37","v":"poeng"}]
[{"$f":"'1'!A38","v":"B"},"00:00:00",{"$f":"'1'!C38","v":"A"},"00:00:00",{"$f":"SUM(B38,D38)","v":"00:00:00"},null,null,null,null,null,null,{"$f":"'1'!L38:N38","v":"- Derav i spesialøvelsene"},null,null,195,{"$f":"'1'!P38","v":"poeng"}]
[{"$f":"'1'!A39","v":"A"},"00:00:00",{"$f":"'1'!C39","v":"B"},"00:00:00",{"$f":"SUM(B39,D39)","v":"00:00:00"},null,null,null,null,null,null,"- Derav i lydighetsøvelsene",null,null,130,{"$f":"'1'!P39","v":"poeng"}]
[{"$f":"'1'!A40","v":"C"},"00:00:00",{"$f":"'1'!C40","v":"A"},"00:00:00",{"$f":"SUM(B40,D40)","v":"00:00:00"},null,null,null,null,null,null,{"$f":"'1'!L40:N40","v":"Cert/CACIT"},null,null,575,{"$f":"'1'!P40","v":"poeng"}]
[{"$f":"'1'!A41","v":"A"},"00:00:00",{"$f":"'1'!C41","v":"D"},"00:00:00",{"$f":"SUM(E37:J40)","v":"00:00:00"},null,null,null,null,null,null,{"$f":"'1'!L41:N41","v":"- Derav i spesialøvelsene"},null,null,312,{"$f":"'1'!P41","v":"poeng"}]
[{"$f":"'1'!A42","v":"Anvendt tid totalt:"},null,null,null,{"$f":"SUM(E38:J41)","v":"00:00:00"},null,null,null,null,null,null,{"$f":"'1'!L42:N42","v":"- Derav i lydighetsøvelsene"},null,null,208,{"$f":"'1'!P42","v":"poeng"}]
[{"$f":"'1'!A43","v":"Øvelser:"},null,null,null,null,{"$f":"'1'!F43","v":"Koeff."},{"$f":"'1'!G43","v":"Karakter"},{"$f":"'1'!H43","v":"Karakter"},"Snitt",{"$f":"'1'!J43","v":"Poeng"}]
[{"$f":"'1'!A44","v":11},{"$f":"'1'!B44","v":"Feltsøk"},null,null,null,10,null,null,{"$f":"IF(G44=\"\",\"\",IF(H44=\"\",\"\",(G44+H44)/2))","v":""},{"$f":"IF(I44=\"\",\"\",IF(I44=0,\"I.G.\",I44*F44))","v":""},null,null,null,null,{"$f":"'1'!O44:P44","v":"Poeng"}]
[{"$f":"'1'!A45","v":12},{"$f":"'1'!B45","v":"Rapport"},null,null,null,{"$f":"'1'!F45","v":29},null,null,{"$f":"IF(G45=\"\",\"\",IF(H45=\"\",\"\",(G45+H45)/2))","v":""},{"$f":"IF(I45=\"\",\"\",IF(I45=0,\"I.G.\",I45*F45))","v":""},null,{"$f":"'1'!L45:N45","v":"Sum Lydighet"},null,null,{"$f":"J24","v":0}]
[{"$f":"'1'!A46","v":"Sum spesialøvelser:"},null,null,null,null,{"$f":"SUM(F44:F45)","v":39},null,null,null,null,null,{"$f":"'1'!L46:N46","v":"Sum Spesialøvelser"},null,null,{"$f":"IF(Resultatskj!H4=\"Rundering\",J35,IF(Resultatskj!H4=\"Spor\",J30,IF(Resultatskj!H4=\"Rapport\",J46,\"\")))","v":""}]
[null,null,null,null,null,null,null,null,null,null,null,{"$f":"'1'!L47:N47","v":"Totalpoeng"},null,null,{"$f":"SUM(O45:P46)","v":0}]
[null,null,null,null,null,null,null,null,null,null,null,{"$f":"'1'!L48","v":"Ikke godkj."},{"$f":"'1'!M48","v":"Godkj."},null,{"$f":"'1'!O48","v":"Cert"},{"$f":"'1'!P48","v":"Plass"}]
[{"$f":"IF(Resultatskj!C3=\"\",\"\",Resultatskj!C3)","v":""},null,null,null,null,{"$f":"IF(Resultatskj!C4=\"\",\"\",Resultatskj!C4)","v":""},null,null,null,null,null,{"$f":"IF(OR(O47<O37,O46<O38,O45<O39,O47=\"\"),\"X\",\"\")","v":"X"},{"$f":"IF(AND(O47>=O37,O46>=O38,O45>=O39,L49=\"\"),\"X\",\"\")","v":""},null,{"$f":"IF(AND(O47>=575,O46>=311.99,O45>207.99,L49=\"\"),\"X\",\"\")","v":""},{"$f":"Resultatskj!A18","v":"-"}]
["Underskrift dommere",null,null,null,null,null,null,null,null,null,null,{"$f":"Resultatskj!K26","v":"B.Strand/A.Bakken 15.07.2015/19.06.2018"}]
[]
[{"$f":"IF(Resultatskj!$C$3=\"\",\"\",Resultatskj!$C$3)","v":""}]
[{"$f":"IF(Resultatskj!$C$4=\"\",\"\",Resultatskj!$C$4)","v":""}]

{"sheet":"12","index":13,"n_rows":53,"n_cols":16,"rows_kept":53,"cut":false,"hidden":false,"merged":[[52,0,52,9],[2,0,2,15],[28,10,28,15],[27,10,27,15],[11,0,11,15],[16,1,16,4],[26,1,26,4],[27,1,27,4],[16,10,16,15],[18,10,18,15],[19,10,19,15],[22,1,22,4],[23,0,23,4],[12,10,12,15],[13,10,13,15],[14,10,14,15],[3,0,3,1],[3,2,3,9],[3,10,3,11],[3,12,3,15],[5,2,5,9],[5,10,5,11],[5,12,5,15],[4,0,4,1],[4,2,4,9],[4,10,4,11],[4,12,4,15],[5,0,5,1],[0,5,0,15],[1,10,1,12],[1,2,1,5],[1,0,1,1],[0,2,0,4],[43,14,43,15],[43,1,43,4],[36,4,36,9],[42,0,42,4],[43,11,43,13],[36,2,36,3],[41,11,41,13],[41,0,41,3],[41,4,41,9],[37,11,37,13],[39,11,39,13],[38,11,38,13],[40,4,40,9],[39,4,39,9],[40,11,40,13],[37,4,37,9],[18,1,18,4],[19,1,19,4],[24,0,24,15],[31,0,31,4],[33,1,33,4],[21,1,21,4],[21,10,21,15],[22,10,22,15],[23,10,23,15],[32,1,32,4],[30,0,30,15],[32,10,32,15],[31,10,31,15],[25,0,25,4],[25,10,25,15],[26,10,26,15],[17,1,17,4],[17,10,17,15],[12,0,12,4],[15,10,15,15],[13,1,13,4],[14,1,14,4],[15,1,15,4],[38,4,38,9],[34,10,34,15],[33,10,33,15],[20,10,20,15],[20,1,20,4],[35,0,35,15],[36,0,36,1],[36,11,36,13],[28,1,28,4],[34,0,34,4],[29,0,29,4],[29,10,29,15],[44,1,44,4],[45,0,45,4],[46,11,46,13],[44,11,44,13],[46,14,46,15],[45,14,45,15],[45,11,45,13],[44,14,44,15],[46,0,48,9],[51,11,51,15],[49,11,49,15],[47,12,47,13],[48,12,48,13],[49,0,49,9],[51,0,51,9]]}
[null,null,null,null,null,{"$f":"'1'!F1:R1","v":"Kl. A - DOMMERPROTOKOLL"}]
[{"$f":"'1'!A2:B2","v":"Dato:"},null,{"$f":"IF(Resultatskj!L2=\"\",\"\",Resultatskj!L2)","v":""},null,null,null,null,null,null,{"$f":"'1'!J2","v":"Gruppe:"},{"$f":"IF(Resultatskj!H4=\"\",\"\",Resultatskj!H4)","v":"Spor"},null,null,null,"Katalog nr.",{"$f":"Resultatskj!B19","v":""}]
[]
[{"$f":"'1'!A4:B4","v":"Arrangør:"},null,{"$f":"IF(Resultatskj!$C$2=\"\",\"\",Resultatskj!$C$2)","v":""},null,null,null,null,null,null,null,{"$f":"'1'!K4:L4","v":"Hundens navn:"}]
[{"$f":"'1'!A5:B5","v":"Fører:"},null,null,null,null,null,null,null,null,null,{"$f":"'1'!K5:L5","v":"Reg.nr.:"}]
[{"$f":"'1'!A6:B6","v":"Klubb:"},null,null,null,null,null,null,null,null,null,{"$f":"'1'!K6:L6","v":"Rase:"}]
[]
[]
[null,"Klasse",null,"Liten",null,null,null,null,null,"Middels",null,null,"Stor"]
[]
[]
[{"$f":"'1'!A12","v":"Lydighet:"}]
[{"$f":"'1'!A13","v":"Øvelser:"},null,null,null,null,"Koeff.","Karakter","Karakter","Snitt","Poeng"]
[{"$f":"'1'!A14","v":1},{"$f":"'1'!B14","v":"Fri ved foten"},null,null,null,3,null,null,{"$f":"IF(G14=\"\",\"\",IF(H14=\"\",\"\",(G14+H14)/2))","v":""},{"$f":"IF(I14=\"\",\"\",IF(I14=0,\"I.G.\",I14*F14))","v":""}]
[{"$f":"'1'!A15","v":2},{"$f":"'1'!B15","v":"Innkalling m/stå og dekk"},null,null,null,3,null,null,{"$f":"IF(G15=\"\",\"\",IF(H15=\"\",\"\",(G15+H15)/2))","v":""},{"$f":"IF(I15=\"\",\"\",IF(I15=0,\"I.G.\",I15*F15))","v":""}]
[{"$f":"'1'!A16","v":3},{"$f":"'1'!B16","v":"Fremadsending"},null,null,null,3,null,null,"",""]
[{"$f":"'1'!A17","v":4},{"$f":"'1'!B17","v":"Kryp"},null,null,null,3,null,null,"",""]
[{"$f":"'1'!A18","v":5},{"$f":"'1'!B18","v":"Hals på kommando"},null,null,null,2,null,null,"",""]
[{"$f":"'1'!A19","v":6},{"$f":"'1'!B19","v":"Apportering metallapport"},null,null,null,3,null,null,"",""]
[{"$f":"'1'!A20","v":7},{"$f":"'1'!B20","v":"Apportering tung gjenstand"},null,null,null,3,null,null,"",""]
[{"$f":"'1'!A21","v":8},"Fritt hopp over hinder",null,null,null,2,null,null,"",""]
[{"$f":"'1'!A22","v":9},{"$f":"'1'!B22","v":"Stigeklatring"},null,null,null,2,null,null,"",""]
[{"$f":"'1'!A23","v":10},{"$f":"'1'!B23","v":"Fellesdekk"},null,null,null,2,null,null,"",""]
[{"$f":"'1'!A24","v":"Sum lydighet:"},null,null,null,null,{"$f":"SUM(F14:F23)","v":26},null,null,null,{"$f":"SUM(J14:J23)","v":0}]
[{"$f":"'1'!A25","v":"Sporgruppen:"}]
[{"$f":"'1'!A26","v":"Øvelser:"},null,null,null,null,"Koeff.","Karakter","Karakter","Snitt","Poeng"]
[{"$f":"'1'!A27","v":11},{"$f":"'1'!B27","v":"Feltsøk"},null,null,null,10,null,null,{"$f":"IF(G27=\"\",\"\",IF(H27=\"\",\"\",(G27+H27)/2))","v":""},{"$f":"IF(I27=\"\",\"\",IF(I27=0,\"I.G.\",I27*F27))","v":""}]
[{"$f":"'1'!A28","v":12},{"$f":"'1'!B28","v":"Sporoppsøk"},null,null,null,5,null,null,{"$f":"IF(G28=\"\",\"\",IF(H28=\"\",\"\",(G28+H28)/2))","v":""},{"$f":"IF(I28=\"\",\"\",IF(I28=0,\"I.G.\",I28*F28))","v":""}]
[{"$f":"'1'!A29","v":13},{"$f":"'1'!B29","v":"Spor"},null,null,null,24,null,null,"",""]
[{"$f":"'1'!A30","v":"Sum spesialøvelser:"},null,null,null,null,{"$f":"SUM(F27:F29)","v":39},null,null,null,{"$f":"IF(AND(J27=\"\",J28=\"\",J29=\"\"),\"\",SUM(J27:J29))","v":""}]
[{"$f":"'1'!A31","v":"Runderingsgruppen:"}]
[{"$f":"'1'!A32","v":"Øvelser:"},null,null,null,null,"Koeff.","Karakter","Karakter","Snitt","Poeng"]
[{"$f":"'1'!A33","v":11},{"$f":"'1'!B33","v":"Feltsøk"},null,null,null,10,null,null,{"$f":"IF(G33=\"\",\"\",IF(H33=\"\",\"\",(G33+H33)/2))","v":""},{"$f":"IF(I33=\"\",\"\",IF(I33=0,\"I.G.\",I33*F33))","v":""}]
[{"$f":"'1'!A34","v":12},{"$f":"'1'!B34","v":"Rundering"},null,null,null,{"$f":"'1'!F34","v":29},null,null,{"$f":"IF(G34=\"\",\"\",IF(H34=\"\",\"\",(G34+H34)/2))","v":""},{"$f":"IF(I34=\"\",\"\",IF(I34=0,\"I.G.\",I34*F34))","v":""}]
[{"$f":"'1'!A35","v":"Sum spesialøvelser:"},null,null,null,null,{"$f":"SUM(F33:F34)","v":39},null,null,null,{"$f":"IF(AND(J33=\"\",J34=\"\"),\"\",SUM(J33:J34))","v":""},null,"Godkjent",null,null,300,"poeng"]
[{"$f":"'1'!A36","v":"Rapportgruppen:"}]
[{"$f":"'1'!A37","v":"Start kl.:"},0,{"$f":"'1'!C37","v":"Ankomst kl.:"},0,{"$f":"'1'!E37:J37","v":"Anvendt tid:"},null,null,null,null,null,null,{"$f":"'1'!L37:N37","v":"Godkjent"},null,null,{"$f":"'1'!O37","v":325},{"$f":"'1'!P37","v":"poeng"}]
[{"$f":"'1'!A38","v":"B"},"00:00:00",{"$f":"'1'!C38","v":"A"},"00:00:00",{"$f":"SUM(B38,D38)","v":"00:00:00"},null,null,null,null,null,null,{"$f":"'1'!L38:N38","v":"- Derav i spesialøvelsene"},null,null,195,{"$f":"'1'!P38","v":"poeng"}]
[{"$f":"'1'!A39","v":"A"},"00:00:00",{"$f":"'1'!C39","v":"B"},"00:00:00",{"$f":"SUM(B39,D39)","v":"00:00:00"},null,null,null,null,null,null,"- Derav i lydighetsøvelsene",null,null,130,{"$f":"'1'!P39","v":"poeng"}]
[{"$f":"'1'!A40","v":"C"},"00:00:00",{"$f":"'1'!C40","v":"A"},"00:00:00",{"$f":"SUM(B40,D40)","v":"00:00:00"},null,null,null,null,null,null,{"$f":"'1'!L40:N40","v":"Cert/CACIT"},null,null,575,{"$f":"'1'!P40","v":"poeng"}]
[{"$f":"'1'!A41","v":"A"},"00:00:00",{"$f":"'1'!C41","v":"D"},"00:00:00",{"$f":"SUM(E37:J40)","v":"00:00:00"},null,null,null,null,null,null,{"$f":"'1'!L41:N41","v":"- Derav i spesialøvelsene"},null,null,312,{"$f":"'1'!P41","v":"poeng"}]
[{"$f":"'1'!A42","v":"Anvendt tid totalt:"},null,null,null,{"$f":"SUM(E38:J41)","v":"00:00:00"},null,null,null,null,null,null,{"$f":"'1'!L42:N42","v":"- Derav i lydighetsøvelsene"},null,null,208,{"$f":"'1'!P42","v":"poeng"}]
[{"$f":"'1'!A43","v":"Øvelser:"},null,null,null,null,{"$f":"'1'!F43","v":"Koeff."},{"$f":"'1'!G43","v":"Karakter"},{"$f":"'1'!H43","v":"Karakter"},"Snitt",{"$f":"'1'!J43","v":"Poeng"}]
[{"$f":"'1'!A44","v":11},{"$f":"'1'!B44","v":"Feltsøk"},null,null,null,10,null,null,{"$f":"IF(G44=\"\",\"\",IF(H44=\"\",\"\",(G44+H44)/2))","v":""},{"$f":"IF(I44=\"\",\"\",IF(I44=0,\"I.G.\",I44*F44))","v":""},null,null,null,null,{"$f":"'1'!O44:P44","v":"Poeng"}]
[{"$f":"'1'!A45","v":12},{"$f":"'1'!B45","v":"Rapport"},null,null,null,{"$f":"'1'!F45","v":29},null,null,{"$f":"IF(G45=\"\",\"\",IF(H45=\"\",\"\",(G45+H45)/2))","v":""},{"$f":"IF(I45=\"\",\"\",IF(I45=0,\"I.G.\",I45*F45))","v":""},null,{"$f":"'1'!L45:N45","v":"Sum Lydighet"},null,null,{"$f":"J24","v":0}]
[{"$f":"'1'!A46","v":"Sum spesialøvelser:"},null,null,null,null,{"$f":"SUM(F44:F45)","v":39},null,null,null,null,null,{"$f":"'1'!L46:N46","v":"Sum Spesialøvelser"},null,null,{"$f":"IF(Resultatskj!H4=\"Rundering\",J35,IF(Resultatskj!H4=\"Spor\",J30,IF(Resultatskj!H4=\"Rapport\",J46,\"\")))","v":""}]
[null,null,null,null,null,null,null,null,null,null,null,{"$f":"'1'!L47:N47","v":"Totalpoeng"},null,null,{"$f":"SUM(O45:P46)","v":0}]
[null,null,null,null,null,null,null,null,null,null,null,{"$f":"'1'!L48","v":"Ikke godkj."},{"$f":"'1'!M48","v":"Godkj."},null,{"$f":"'1'!O48","v":"Cert"},{"$f":"'1'!P48","v":"Plass"}]
[{"$f":"IF(Resultatskj!C3=\"\",\"\",Resultatskj!C3)","v":""},null,null,null,null,{"$f":"IF(Resultatskj!C4=\"\",\"\",Resultatskj!C4)","v":""},null,null,null,null,null,{"$f":"IF(OR(O47<O37,O46<O38,O45<O39,O47=\"\"),\"X\",\"\")","v":"X"},{"$f":"IF(AND(O47>=O37,O46>=O38,O45>=O39,L49=\"\"),\"X\",\"\")","v":""},null,{"$f":"IF(AND(O47>=575,O46>=311.99,O45>207.99,L49=\"\"),\"X\",\"\")","v":""},{"$f":"Resultatskj!A19","v":"-"}]
["Underskrift dommere",null,null,null,null,null,null,null,null,null,null,{"$f":"Resultatskj!K26","v":"B.Strand/A.Bakken 15.07.2015/19.06.2018"}]
[]
[{"$f":"IF(Resultatskj!$C$3=\"\",\"\",Resultatskj!$C$3)","v":""}]
[{"$f":"IF(Resultatskj!$C$4=\"\",\"\",Resultatskj!$C$4)","v":""}]

{"sheet":"13","index":14,"n_rows":53,"n_cols":16,"rows_kept":53,"cut":false,"hidden":false,"merged":[[52,0,52,9],[18,10,18,15],[20,1,20,4],[17,10,17,15],[19,10,19,15],[32,1,32,4],[25,10,25,15],[26,10,26,15],[32,10,32,15],[27,10,27,15],[31,10,31,15],[20,10,20,15],[22,10,22,15],[23,10,23,15],[24,0,24,15],[21,10,21,15],[0,5,0,15],[28,10,28,15],[45,11,45,13],[3,2,3,9],[38,4,38,9],[40,11,40,13],[39,11,39,13],[39,4,39,9],[33,10,33,15],[3,12,3,15],[16,10,16,15],[11,0,11,15],[16,1,16,4],[3,0,3,1],[3,10,3,11],[17,1,17,4],[1,0,1,1],[1,2,1,5],[1,10,1,12],[2,0,2,15],[4,10,4,11],[4,0,4,1],[4,2,4,9],[4,12,4,15],[5,0,5,1],[5,2,5,9],[5,10,5,11],[5,12,5,15],[15,1,15,4],[15,10,15,15],[14,10,14,15],[12,0,12,4],[12,10,12,15],[13,1,13,4],[13,10,13,15],[35,0,35,15],[36,0,36,1],[36,2,36,3],[41,0,41,3],[41,4,41,9],[37,11,37,13],[37,4,37,9],[40,4,40,9],[34,10,34,15],[29,10,29,15],[30,0,30,15],[31,0,31,4],[33,1,33,4],[34,0,34,4],[25,0,25,4],[28,1,28,4],[29,0,29,4],[18,1,18,4],[19,1,19,4],[26,1,26,4],[27,1,27,4],[22,1,22,4],[23,0,23,4],[21,1,21,4],[0,2,0,4],[44,14,44,15],[44,11,44,13],[47,12,47,13],[48,12,48,13],[36,4,36,9],[36,11,36,13],[46,0,48,9],[46,11,46,13],[46,14,46,15],[45,14,45,15],[42,0,42,4],[43,11,43,13],[43,14,43,15],[43,1,43,4],[14,1,14,4],[51,11,51,15],[49,11,49,15],[38,11,38,13],[44,1,44,4],[45,0,45,4],[49,0,49,9],[41,11,41,13],[51,0,51,9]]}
[null,null,null,null,null,{"$f":"'1'!F1:R1","v":"Kl. A - DOMMERPROTOKOLL"}]
[{"$f":"'1'!A2:B2","v":"Dato:"},null,{"$f":"IF(Resultatskj!L2=\"\",\"\",Resultatskj!L2)","v":""},null,null,null,null,null,null,{"$f":"'1'!J2","v":"Gruppe:"},{"$f":"IF(Resultatskj!H4=\"\",\"\",Resultatskj!H4)","v":"Spor"},null,null,null,"Katalog nr.",{"$f":"Resultatskj!B20","v":""}]
[]
[{"$f":"'1'!A4:B4","v":"Arrangør:"},null,{"$f":"IF(Resultatskj!$C$2=\"\",\"\",Resultatskj!$C$2)","v":""},null,null,null,null,null,null,null,{"$f":"'1'!K4:L4","v":"Hundens navn:"}]
[{"$f":"'1'!A5:B5","v":"Fører:"},null,null,null,null,null,null,null,null,null,{"$f":"'1'!K5:L5","v":"Reg.nr.:"}]
[{"$f":"'1'!A6:B6","v":"Klubb:"},null,null,null,null,null,null,null,null,null,{"$f":"'1'!K6:L6","v":"Rase:"}]
[]
[]
[null,"Klasse",null,"Liten",null,null,null,null,null,"Middels",null,null,"Stor"]
[]
[]
[{"$f":"'1'!A12","v":"Lydighet:"}]
[{"$f":"'1'!A13","v":"Øvelser:"},null,null,null,null,"Koeff.","Karakter","Karakter","Snitt","Poeng"]
[{"$f":"'1'!A14","v":1},{"$f":"'1'!B14","v":"Fri ved foten"},null,null,null,3,null,null,{"$f":"IF(G14=\"\",\"\",IF(H14=\"\",\"\",(G14+H14)/2))","v":""},{"$f":"IF(I14=\"\",\"\",IF(I14=0,\"I.G.\",I14*F14))","v":""}]
[{"$f":"'1'!A15","v":2},{"$f":"'1'!B15","v":"Innkalling m/stå og dekk"},null,null,null,3,null,null,{"$f":"IF(G15=\"\",\"\",IF(H15=\"\",\"\",(G15+H15)/2))","v":""},{"$f":"IF(I15=\"\",\"\",IF(I15=0,\"I.G.\",I15*F15))","v":""}]
[{"$f":"'1'!A16","v":3},{"$f":"'1'!B16","v":"Fremadsending"},null,null,null,3,null,null,"",""]
[{"$f":"'1'!A17","v":4},{"$f":"'1'!B17","v":"Kryp"},null,null,null,3,null,null,"",""]
[{"$f":"'1'!A18","v":5},{"$f":"'1'!B18","v":"Hals på kommando"},null,null,null,2,null,null,"",""]
[{"$f":"'1'!A19","v":6},{"$f":"'1'!B19","v":"Apportering metallapport"},null,null,null,3,null,null,"",""]
[{"$f":"'1'!A20","v":7},{"$f":"'1'!B20","v":"Apportering tung gjenstand"},null,null,null,3,null,null,"",""]
[{"$f":"'1'!A21","v":8},"Fritt hopp over hinder",null,null,null,2,null,null,"",""]
[{"$f":"'1'!A22","v":9},{"$f":"'1'!B22","v":"Stigeklatring"},null,null,null,2,null,null,"",""]
[{"$f":"'1'!A23","v":10},{"$f":"'1'!B23","v":"Fellesdekk"},null,null,null,2,null,null,"",""]
[{"$f":"'1'!A24","v":"Sum lydighet:"},null,null,null,null,{"$f":"SUM(F14:F23)","v":26},null,null,null,{"$f":"SUM(J14:J23)","v":0}]
[{"$f":"'1'!A25","v":"Sporgruppen:"}]
[{"$f":"'1'!A26","v":"Øvelser:"},null,null,null,null,"Koeff.","Karakter","Karakter","Snitt","Poeng"]
[{"$f":"'1'!A27","v":11},{"$f":"'1'!B27","v":"Feltsøk"},null,null,null,10,null,null,{"$f":"IF(G27=\"\",\"\",IF(H27=\"\",\"\",(G27+H27)/2))","v":""},{"$f":"IF(I27=\"\",\"\",IF(I27=0,\"I.G.\",I27*F27))","v":""}]
[{"$f":"'1'!A28","v":12},{"$f":"'1'!B28","v":"Sporoppsøk"},null,null,null,5,null,null,{"$f":"IF(G28=\"\",\"\",IF(H28=\"\",\"\",(G28+H28)/2))","v":""},{"$f":"IF(I28=\"\",\"\",IF(I28=0,\"I.G.\",I28*F28))","v":""}]
[{"$f":"'1'!A29","v":13},{"$f":"'1'!B29","v":"Spor"},null,null,null,24,null,null,"",""]
[{"$f":"'1'!A30","v":"Sum spesialøvelser:"},null,null,null,null,{"$f":"SUM(F27:F29)","v":39},null,null,null,{"$f":"IF(AND(J27=\"\",J28=\"\",J29=\"\"),\"\",SUM(J27:J29))","v":""}]
[{"$f":"'1'!A31","v":"Runderingsgruppen:"}]
[{"$f":"'1'!A32","v":"Øvelser:"},null,null,null,null,"Koeff.","Karakter","Karakter","Snitt","Poeng"]
[{"$f":"'1'!A33","v":11},{"$f":"'1'!B33","v":"Feltsøk"},null,null,null,10,null,null,{"$f":"IF(G33=\"\",\"\",IF(H33=\"\",\"\",(G33+H33)/2))","v":""},{"$f":"IF(I33=\"\",\"\",IF(I33=0,\"I.G.\",I33*F33))","v":""}]
[{"$f":"'1'!A34","v":12},{"$f":"'1'!B34","v":"Rundering"},null,null,null,{"$f":"'1'!F34","v":29},null,null,{"$f":"IF(G34=\"\",\"\",IF(H34=\"\",\"\",(G34+H34)/2))","v":""},{"$f":"IF(I34=\"\",\"\",IF(I34=0,\"I.G.\",I34*F34))","v":""}]
[{"$f":"'1'!A35","v":"Sum spesialøvelser:"},null,null,null,null,{"$f":"SUM(F33:F34)","v":39},null,null,null,{"$f":"IF(AND(J33=\"\",J34=\"\"),\"\",SUM(J33:J34))","v":""},null,"Godkjent",null,null,300,"poeng"]
[{"$f":"'1'!A36","v":"Rapportgruppen:"}]
[{"$f":"'1'!A37","v":"Start kl.:"},0,{"$f":"'1'!C37","v":"Ankomst kl.:"},0,{"$f":"'1'!E37:J37","v":"Anvendt tid:"},null,null,null,null,null,null,{"$f":"'1'!L37:N37","v":"Godkjent"},null,null,{"$f":"'1'!O37","v":325},{"$f":"'1'!P37","v":"poeng"}]
[{"$f":"'1'!A38","v":"B"},"00:00:00",{"$f":"'1'!C38","v":"A"},"00:00:00",{"$f":"SUM(B38,D38)","v":"00:00:00"},null,null,null,null,null,null,{"$f":"'1'!L38:N38","v":"- Derav i spesialøvelsene"},null,null,195,{"$f":"'1'!P38","v":"poeng"}]
[{"$f":"'1'!A39","v":"A"},"00:00:00",{"$f":"'1'!C39","v":"B"},"00:00:00",{"$f":"SUM(B39,D39)","v":"00:00:00"},null,null,null,null,null,null,"- Derav i lydighetsøvelsene",null,null,130,{"$f":"'1'!P39","v":"poeng"}]
[{"$f":"'1'!A40","v":"C"},"00:00:00",{"$f":"'1'!C40","v":"A"},"00:00:00",{"$f":"SUM(B40,D40)","v":"00:00:00"},null,null,null,null,null,null,{"$f":"'1'!L40:N40","v":"Cert/CACIT"},null,null,575,{"$f":"'1'!P40","v":"poeng"}]
[{"$f":"'1'!A41","v":"A"},"00:00:00",{"$f":"'1'!C41","v":"D"},"00:00:00",{"$f":"SUM(E37:J40)","v":"00:00:00"},null,null,null,null,null,null,{"$f":"'1'!L41:N41","v":"- Derav i spesialøvelsene"},null,null,312,{"$f":"'1'!P41","v":"poeng"}]
[{"$f":"'1'!A42","v":"Anvendt tid totalt:"},null,null,null,{"$f":"SUM(E38:J41)","v":"00:00:00"},null,null,null,null,null,null,{"$f":"'1'!L42:N42","v":"- Derav i lydighetsøvelsene"},null,null,208,{"$f":"'1'!P42","v":"poeng"}]
[{"$f":"'1'!A43","v":"Øvelser:"},null,null,null,null,{"$f":"'1'!F43","v":"Koeff."},{"$f":"'1'!G43","v":"Karakter"},{"$f":"'1'!H43","v":"Karakter"},"Snitt",{"$f":"'1'!J43","v":"Poeng"}]
[{"$f":"'1'!A44","v":11},{"$f":"'1'!B44","v":"Feltsøk"},null,null,null,10,null,null,{"$f":"IF(G44=\"\",\"\",IF(H44=\"\",\"\",(G44+H44)/2))","v":""},{"$f":"IF(I44=\"\",\"\",IF(I44=0,\"I.G.\",I44*F44))","v":""},null,null,null,null,{"$f":"'1'!O44:P44","v":"Poeng"}]
[{"$f":"'1'!A45","v":12},{"$f":"'1'!B45","v":"Rapport"},null,null,null,{"$f":"'1'!F45","v":29},null,null,{"$f":"IF(G45=\"\",\"\",IF(H45=\"\",\"\",(G45+H45)/2))","v":""},{"$f":"IF(I45=\"\",\"\",IF(I45=0,\"I.G.\",I45*F45))","v":""},null,{"$f":"'1'!L45:N45","v":"Sum Lydighet"},null,null,{"$f":"J24","v":0}]
[{"$f":"'1'!A46","v":"Sum spesialøvelser:"},null,null,null,null,{"$f":"SUM(F44:F45)","v":39},null,null,null,null,null,{"$f":"'1'!L46:N46","v":"Sum Spesialøvelser"},null,null,{"$f":"IF(Resultatskj!H4=\"Rundering\",J35,IF(Resultatskj!H4=\"Spor\",J30,IF(Resultatskj!H4=\"Rapport\",J46,\"\")))","v":""}]
[null,null,null,null,null,null,null,null,null,null,null,{"$f":"'1'!L47:N47","v":"Totalpoeng"},null,null,{"$f":"SUM(O45:P46)","v":0}]
[null,null,null,null,null,null,null,null,null,null,null,{"$f":"'1'!L48","v":"Ikke godkj."},{"$f":"'1'!M48","v":"Godkj."},null,{"$f":"'1'!O48","v":"Cert"},{"$f":"'1'!P48","v":"Plass"}]
[{"$f":"IF(Resultatskj!C3=\"\",\"\",Resultatskj!C3)","v":""},null,null,null,null,{"$f":"IF(Resultatskj!C4=\"\",\"\",Resultatskj!C4)","v":""},null,null,null,null,null,{"$f":"IF(OR(O47<O37,O46<O38,O45<O39,O47=\"\"),\"X\",\"\")","v":"X"},{"$f":"IF(AND(O47>=O37,O46>=O38,O45>=O39,L49=\"\"),\"X\",\"\")","v":""},null,{"$f":"IF(AND(O47>=575,O46>=311.99,O45>207.99,L49=\"\"),\"X\",\"\")","v":""},{"$f":"Resultatskj!A20","v":"-"}]
["Underskrift dommere",null,null,null,null,null,null,null,null,null,null,{"$f":"Resultatskj!K26","v":"B.Strand/A.Bakken 15.07.2015/19.06.2018"}]
[]
[{"$f":"IF(Resultatskj!$C$3=\"\",\"\",Resultatskj!$C$3)","v":""}]
[{"$f":"IF(Resultatskj!$C$4=\"\",\"\",Resultatskj!$C$4)","v":""}]

{"sheet":"14","index":15,"n_rows":53,"n_cols":16,"rows_kept":53,"cut":false,"hidden":false,"merged":[[52,0,52,9],[2,0,2,15],[28,10,28,15],[27,10,27,15],[11,0,11,15],[16,1,16,4],[26,1,26,4],[27,1,27,4],[16,10,16,15],[18,10,18,15],[19,10,19,15],[22,1,22,4],[23,0,23,4],[12,10,12,15],[13,10,13,15],[14,10,14,15],[3,0,3,1],[3,2,3,9],[3,10,3,11],[3,12,3,15],[5,2,5,9],[5,10,5,11],[5,12,5,15],[4,0,4,1],[4,2,4,9],[4,10,4,11],[4,12,4,15],[5,0,5,1],[0,5,0,15],[1,10,1,12],[1,2,1,5],[1,0,1,1],[0,2,0,4],[43,14,43,15],[43,1,43,4],[36,4,36,9],[42,0,42,4],[43,11,43,13],[36,2,36,3],[41,11,41,13],[41,0,41,3],[41,4,41,9],[37,11,37,13],[39,11,39,13],[38,11,38,13],[40,4,40,9],[39,4,39,9],[40,11,40,13],[37,4,37,9],[18,1,18,4],[19,1,19,4],[24,0,24,15],[31,0,31,4],[33,1,33,4],[21,1,21,4],[21,10,21,15],[22,10,22,15],[23,10,23,15],[32,1,32,4],[30,0,30,15],[32,10,32,15],[31,10,31,15],[25,0,25,4],[25,10,25,15],[26,10,26,15],[17,1,17,4],[17,10,17,15],[12,0,12,4],[15,10,15,15],[13,1,13,4],[14,1,14,4],[15,1,15,4],[38,4,38,9],[34,10,34,15],[33,10,33,15],[20,10,20,15],[20,1,20,4],[35,0,35,15],[36,0,36,1],[36,11,36,13],[28,1,28,4],[34,0,34,4],[29,0,29,4],[29,10,29,15],[44,1,44,4],[45,0,45,4],[46,11,46,13],[44,11,44,13],[46,14,46,15],[45,14,45,15],[45,11,45,13],[44,14,44,15],[46,0,48,9],[51,11,51,15],[49,11,49,15],[47,12,47,13],[48,12,48,13],[49,0,49,9],[51,0,51,9]]}
[null,null,null,null,null,{"$f":"'1'!F1:R1","v":"Kl. A - DOMMERPROTOKOLL"}]
[{"$f":"'1'!A2:B2","v":"Dato:"},null,{"$f":"IF(Resultatskj!L2=\"\",\"\",Resultatskj!L2)","v":""},null,null,null,null,null,null,{"$f":"'1'!J2","v":"Gruppe:"},{"$f":"IF(Resultatskj!H4=\"\",\"\",Resultatskj!H4)","v":"Spor"},null,null,null,"Katalog nr.",{"$f":"Resultatskj!B21","v":""}]
[]
[{"$f":"'1'!A4:B4","v":"Arrangør:"},null,{"$f":"IF(Resultatskj!$C$2=\"\",\"\",Resultatskj!$C$2)","v":""},null,null,null,null,null,null,null,{"$f":"'1'!K4:L4","v":"Hundens navn:"}]
[{"$f":"'1'!A5:B5","v":"Fører:"},null,null,null,null,null,null,null,null,null,{"$f":"'1'!K5:L5","v":"Reg.nr.:"}]
[{"$f":"'1'!A6:B6","v":"Klubb:"},null,null,null,null,null,null,null,null,null,{"$f":"'1'!K6:L6","v":"Rase:"}]
[]
[]
[null,"Klasse",null,"Liten",null,null,null,null,null,"Middels",null,null,"Stor"]
[]
[]
[{"$f":"'1'!A12","v":"Lydighet:"}]
[{"$f":"'1'!A13","v":"Øvelser:"},null,null,null,null,"Koeff.","Karakter","Karakter","Snitt","Poeng"]
[{"$f":"'1'!A14","v":1},{"$f":"'1'!B14","v":"Fri ved foten"},null,null,null,3,null,null,{"$f":"IF(G14=\"\",\"\",IF(H14=\"\",\"\",(G14+H14)/2))","v":""},{"$f":"IF(I14=\"\",\"\",IF(I14=0,\"I.G.\",I14*F14))","v":""}]
[{"$f":"'1'!A15","v":2},{"$f":"'1'!B15","v":"Innkalling m/stå og dekk"},null,null,null,3,null,null,{"$f":"IF(G15=\"\",\"\",IF(H15=\"\",\"\",(G15+H15)/2))","v":""},{"$f":"IF(I15=\"\",\"\",IF(I15=0,\"I.G.\",I15*F15))","v":""}]
[{"$f":"'1'!A16","v":3},{"$f":"'1'!B16","v":"Fremadsending"},null,null,null,3,null,null,"",""]
[{"$f":"'1'!A17","v":4},{"$f":"'1'!B17","v":"Kryp"},null,null,null,3,null,null,"",""]
[{"$f":"'1'!A18","v":5},{"$f":"'1'!B18","v":"Hals på kommando"},null,null,null,2,null,null,"",""]
[{"$f":"'1'!A19","v":6},{"$f":"'1'!B19","v":"Apportering metallapport"},null,null,null,3,null,null,"",""]
[{"$f":"'1'!A20","v":7},{"$f":"'1'!B20","v":"Apportering tung gjenstand"},null,null,null,3,null,null,"",""]
[{"$f":"'1'!A21","v":8},"Fritt hopp over hinder",null,null,null,2,null,null,"",""]
[{"$f":"'1'!A22","v":9},{"$f":"'1'!B22","v":"Stigeklatring"},null,null,null,2,null,null,"",""]
[{"$f":"'1'!A23","v":10},{"$f":"'1'!B23","v":"Fellesdekk"},null,null,null,2,null,null,"",""]
[{"$f":"'1'!A24","v":"Sum lydighet:"},null,null,null,null,{"$f":"SUM(F14:F23)","v":26},null,null,null,{"$f":"SUM(J14:J23)","v":0}]
[{"$f":"'1'!A25","v":"Sporgruppen:"}]
[{"$f":"'1'!A26","v":"Øvelser:"},null,null,null,null,"Koeff.","Karakter","Karakter","Snitt","Poeng"]
[{"$f":"'1'!A27","v":11},{"$f":"'1'!B27","v":"Feltsøk"},null,null,null,10,null,null,{"$f":"IF(G27=\"\",\"\",IF(H27=\"\",\"\",(G27+H27)/2))","v":""},{"$f":"IF(I27=\"\",\"\",IF(I27=0,\"I.G.\",I27*F27))","v":""}]
[{"$f":"'1'!A28","v":12},{"$f":"'1'!B28","v":"Sporoppsøk"},null,null,null,5,null,null,{"$f":"IF(G28=\"\",\"\",IF(H28=\"\",\"\",(G28+H28)/2))","v":""},{"$f":"IF(I28=\"\",\"\",IF(I28=0,\"I.G.\",I28*F28))","v":""}]
[{"$f":"'1'!A29","v":13},{"$f":"'1'!B29","v":"Spor"},null,null,null,24,null,null,"",""]
[{"$f":"'1'!A30","v":"Sum spesialøvelser:"},null,null,null,null,{"$f":"SUM(F27:F29)","v":39},null,null,null,{"$f":"IF(AND(J27=\"\",J28=\"\",J29=\"\"),\"\",SUM(J27:J29))","v":""}]
[{"$f":"'1'!A31","v":"Runderingsgruppen:"}]
[{"$f":"'1'!A32","v":"Øvelser:"},null,null,null,null,"Koeff.","Karakter","Karakter","Snitt","Poeng"]
[{"$f":"'1'!A33","v":11},{"$f":"'1'!B33","v":"Feltsøk"},null,null,null,10,null,null,{"$f":"IF(G33=\"\",\"\",IF(H33=\"\",\"\",(G33+H33)/2))","v":""},{"$f":"IF(I33=\"\",\"\",IF(I33=0,\"I.G.\",I33*F33))","v":""}]
[{"$f":"'1'!A34","v":12},{"$f":"'1'!B34","v":"Rundering"},null,null,null,{"$f":"'1'!F34","v":29},null,null,{"$f":"IF(G34=\"\",\"\",IF(H34=\"\",\"\",(G34+H34)/2))","v":""},{"$f":"IF(I34=\"\",\"\",IF(I34=0,\"I.G.\",I34*F34))","v":""}]
[{"$f":"'1'!A35","v":"Sum spesialøvelser:"},null,null,null,null,{"$f":"SUM(F33:F34)","v":39},null,null,null,{"$f":"IF(AND(J33=\"\",J34=\"\"),\"\",SUM(J33:J34))","v":""},null,"Godkjent",null,null,300,"poeng"]
[{"$f":"'1'!A36","v":"Rapportgruppen:"}]
[{"$f":"'1'!A37","v":"Start kl.:"},0,{"$f":"'1'!C37","v":"Ankomst kl.:"},0,{"$f":"'1'!E37:J37","v":"Anvendt tid:"},null,null,null,null,null,null,{"$f":"'1'!L37:N37","v":"Godkjent"},null,null,{"$f":"'1'!O37","v":325},{"$f":"'1'!P37","v":"poeng"}]
[{"$f":"'1'!A38","v":"B"},"00:00:00",{"$f":"'1'!C38","v":"A"},"00:00:00",{"$f":"SUM(B38,D38)","v":"00:00:00"},null,null,null,null,null,null,{"$f":"'1'!L38:N38","v":"- Derav i spesialøvelsene"},null,null,195,{"$f":"'1'!P38","v":"poeng"}]
[{"$f":"'1'!A39","v":"A"},"00:00:00",{"$f":"'1'!C39","v":"B"},"00:00:00",{"$f":"SUM(B39,D39)","v":"00:00:00"},null,null,null,null,null,null,"- Derav i lydighetsøvelsene",null,null,130,{"$f":"'1'!P39","v":"poeng"}]
[{"$f":"'1'!A40","v":"C"},"00:00:00",{"$f":"'1'!C40","v":"A"},"00:00:00",{"$f":"SUM(B40,D40)","v":"00:00:00"},null,null,null,null,null,null,{"$f":"'1'!L40:N40","v":"Cert/CACIT"},null,null,575,{"$f":"'1'!P40","v":"poeng"}]
[{"$f":"'1'!A41","v":"A"},"00:00:00",{"$f":"'1'!C41","v":"D"},"00:00:00",{"$f":"SUM(E37:J40)","v":"00:00:00"},null,null,null,null,null,null,{"$f":"'1'!L41:N41","v":"- Derav i spesialøvelsene"},null,null,312,{"$f":"'1'!P41","v":"poeng"}]
[{"$f":"'1'!A42","v":"Anvendt tid totalt:"},null,null,null,{"$f":"SUM(E38:J41)","v":"00:00:00"},null,null,null,null,null,null,{"$f":"'1'!L42:N42","v":"- Derav i lydighetsøvelsene"},null,null,208,{"$f":"'1'!P42","v":"poeng"}]
[{"$f":"'1'!A43","v":"Øvelser:"},null,null,null,null,{"$f":"'1'!F43","v":"Koeff."},{"$f":"'1'!G43","v":"Karakter"},{"$f":"'1'!H43","v":"Karakter"},"Snitt",{"$f":"'1'!J43","v":"Poeng"}]
[{"$f":"'1'!A44","v":11},{"$f":"'1'!B44","v":"Feltsøk"},null,null,null,10,null,null,{"$f":"IF(G44=\"\",\"\",IF(H44=\"\",\"\",(G44+H44)/2))","v":""},{"$f":"IF(I44=\"\",\"\",IF(I44=0,\"I.G.\",I44*F44))","v":""},null,null,null,null,{"$f":"'1'!O44:P44","v":"Poeng"}]
[{"$f":"'1'!A45","v":12},{"$f":"'1'!B45","v":"Rapport"},null,null,null,{"$f":"'1'!F45","v":29},null,null,{"$f":"IF(G45=\"\",\"\",IF(H45=\"\",\"\",(G45+H45)/2))","v":""},{"$f":"IF(I45=\"\",\"\",IF(I45=0,\"I.G.\",I45*F45))","v":""},null,{"$f":"'1'!L45:N45","v":"Sum Lydighet"},null,null,{"$f":"J24","v":0}]
[{"$f":"'1'!A46","v":"Sum spesialøvelser:"},null,null,null,null,{"$f":"SUM(F44:F45)","v":39},null,null,null,null,null,{"$f":"'1'!L46:N46","v":"Sum Spesialøvelser"},null,null,{"$f":"IF(Resultatskj!H4=\"Rundering\",J35,IF(Resultatskj!H4=\"Spor\",J30,IF(Resultatskj!H4=\"Rapport\",J46,\"\")))","v":""}]
[null,null,null,null,null,null,null,null,null,null,null,{"$f":"'1'!L47:N47","v":"Totalpoeng"},null,null,{"$f":"SUM(O45:P46)","v":0}]
[null,null,null,null,null,null,null,null,null,null,null,{"$f":"'1'!L48","v":"Ikke godkj."},{"$f":"'1'!M48","v":"Godkj."},null,{"$f":"'1'!O48","v":"Cert"},{"$f":"'1'!P48","v":"Plass"}]
[{"$f":"IF(Resultatskj!C3=\"\",\"\",Resultatskj!C3)","v":""},null,null,null,null,{"$f":"IF(Resultatskj!C4=\"\",\"\",Resultatskj!C4)","v":""},null,null,null,null,null,{"$f":"IF(OR(O47<O37,O46<O38,O45<O39,O47=\"\"),\"X\",\"\")","v":"X"},{"$f":"IF(AND(O47>=O37,O46>=O38,O45>=O39,L49=\"\"),\"X\",\"\")","v":""},null,{"$f":"IF(AND(O47>=575,O46>=311.99,O45>207.99,L49=\"\"),\"X\",\"\")","v":""},{"$f":"Resultatskj!A21","v":"-"}]
["Underskrift dommere",null,null,null,null,null,null,null,null,null,null,{"$f":"Resultatskj!K26","v":"B.Strand/A.Bakken 15.07.2015/19.06.2018"}]
[]
[{"$f":"IF(Resultatskj!$C$3=\"\",\"\",Resultatskj!$C$3)","v":""}]
[{"$f":"IF(Resultatskj!$C$4=\"\",\"\",Resultatskj!$C$4)","v":""}]

{"sheet":"15","index":16,"n_rows":53,"n_cols":16,"rows_kept":53,"cut":false,"hidden":false,"merged":[[52,0,52,9],[18,10,18,15],[20,1,20,4],[17,10,17,15],[19,10,19,15],[32,1,32,4],[25,10,25,15],[26,10,26,15],[32,10,32,15],[27,10,27,15],[31,10,31,15],[20,10,20,15],[22,10,22,15],[23,10,23,15],[24,0,24,15],[21,10,21,15],[0,5,0,15],[28,10,28,15],[45,11,45,13],[3,2,3,9],[38,4,38,9],[40,11,40,13],[39,11,39,13],[39,4,39,9],[33,10,33,15],[3,12,3,15],[16,10,16,15],[11,0,11,15],[16,1,16,4],[3,0,3,1],[3,10,3,11],[17,1,17,4],[1,0,1,1],[1,2,1,5],[1,10,1,12],[2,0,2,15],[4,10,4,11],[4,0,4,1],[4,2,4,9],[4,12,4,15],[5,0,5,1],[5,2,5,9],[5,10,5,11],[5,12,5,15],[15,1,15,4],[15,10,15,15],[14,10,14,15],[12,0,12,4],[12,10,12,15],[13,1,13,4],[13,10,13,15],[35,0,35,15],[36,0,36,1],[36,2,36,3],[41,0,41,3],[41,4,41,9],[37,11,37,13],[37,4,37,9],[40,4,40,9],[34,10,34,15],[29,10,29,15],[30,0,30,15],[31,0,31,4],[33,1,33,4],[34,0,34,4],[25,0,25,4],[28,1,28,4],[29,0,29,4],[18,1,18,4],[19,1,19,4],[26,1,26,4],[27,1,27,4],[22,1,22,4],[23,0,23,4],[21,1,21,4],[0,2,0,4],[44,14,44,15],[44,11,44,13],[47,12,47,13],[48,12,48,13],[36,4,36,9],[36,11,36,13],[46,0,48,9],[46,11,46,13],[46,14,46,15],[45,14,45,15],[42,0,42,4],[43,11,43,13],[43,14,43,15],[43,1,43,4],[14,1,14,4],[51,11,51,15],[49,11,49,15],[38,11,38,13],[44,1,44,4],[45,0,45,4],[49,0,49,9],[41,11,41,13],[51,0,51,9]]}
[null,null,null,null,null,{"$f":"'1'!F1:R1","v":"Kl. A - DOMMERPROTOKOLL"}]
[{"$f":"'1'!A2:B2","v":"Dato:"},null,{"$f":"IF(Resultatskj!L2=\"\",\"\",Resultatskj!L2)","v":""},null,null,null,null,null,null,{"$f":"'1'!J2","v":"Gruppe:"},{"$f":"IF(Resultatskj!H4=\"\",\"\",Resultatskj!H4)","v":"Spor"},null,null,null,"Katalog nr.",{"$f":"Resultatskj!B22","v":""}]
[]
[{"$f":"'1'!A4:B4","v":"Arrangør:"},null,{"$f":"IF(Resultatskj!$C$2=\"\",\"\",Resultatskj!$C$2)","v":""},null,null,null,null,null,null,null,{"$f":"'1'!K4:L4","v":"Hundens navn:"}]
[{"$f":"'1'!A5:B5","v":"Fører:"},null,null,null,null,null,null,null,null,null,{"$f":"'1'!K5:L5","v":"Reg.nr.:"}]
[{"$f":"'1'!A6:B6","v":"Klubb:"},null,null,null,null,null,null,null,null,null,{"$f":"'1'!K6:L6","v":"Rase:"}]
[]
[]
[null,"Klasse",null,"Liten",null,null,null,null,null,"Middels",null,null,"Stor"]
[]
[]
[{"$f":"'1'!A12","v":"Lydighet:"}]
[{"$f":"'1'!A13","v":"Øvelser:"},null,null,null,null,"Koeff.","Karakter","Karakter","Snitt","Poeng"]
[{"$f":"'1'!A14","v":1},{"$f":"'1'!B14","v":"Fri ved foten"},null,null,null,3,null,null,{"$f":"IF(G14=\"\",\"\",IF(H14=\"\",\"\",(G14+H14)/2))","v":""},{"$f":"IF(I14=\"\",\"\",IF(I14=0,\"I.G.\",I14*F14))","v":""}]
[{"$f":"'1'!A15","v":2},{"$f":"'1'!B15","v":"Innkalling m/stå og dekk"},null,null,null,3,null,null,{"$f":"IF(G15=\"\",\"\",IF(H15=\"\",\"\",(G15+H15)/2))","v":""},{"$f":"IF(I15=\"\",\"\",IF(I15=0,\"I.G.\",I15*F15))","v":""}]
[{"$f":"'1'!A16","v":3},{"$f":"'1'!B16","v":"Fremadsending"},null,null,null,3,null,null,"",""]
[{"$f":"'1'!A17","v":4},{"$f":"'1'!B17","v":"Kryp"},null,null,null,3,null,null,"",""]
[{"$f":"'1'!A18","v":5},{"$f":"'1'!B18","v":"Hals på kommando"},null,null,null,2,null,null,"",""]
[{"$f":"'1'!A19","v":6},{"$f":"'1'!B19","v":"Apportering metallapport"},null,null,null,3,null,null,"",""]
[{"$f":"'1'!A20","v":7},{"$f":"'1'!B20","v":"Apportering tung gjenstand"},null,null,null,3,null,null,"",""]
[{"$f":"'1'!A21","v":8},"Fritt hopp over hinder",null,null,null,2,null,null,"",""]
[{"$f":"'1'!A22","v":9},{"$f":"'1'!B22","v":"Stigeklatring"},null,null,null,2,null,null,"",""]
[{"$f":"'1'!A23","v":10},{"$f":"'1'!B23","v":"Fellesdekk"},null,null,null,2,null,null,"",""]
[{"$f":"'1'!A24","v":"Sum lydighet:"},null,null,null,null,{"$f":"SUM(F14:F23)","v":26},null,null,null,{"$f":"SUM(J14:J23)","v":0}]
[{"$f":"'1'!A25","v":"Sporgruppen:"}]
[{"$f":"'1'!A26","v":"Øvelser:"},null,null,null,null,"Koeff.","Karakter","Karakter","Snitt","Poeng"]
[{"$f":"'1'!A27","v":11},{"$f":"'1'!B27","v":"Feltsøk"},null,null,null,10,null,null,{"$f":"IF(G27=\"\",\"\",IF(H27=\"\",\"\",(G27+H27)/2))","v":""},{"$f":"IF(I27=\"\",\"\",IF(I27=0,\"I.G.\",I27*F27))","v":""}]
[{"$f":"'1'!A28","v":12},{"$f":"'1'!B28","v":"Sporoppsøk"},null,null,null,5,null,null,{"$f":"IF(G28=\"\",\"\",IF(H28=\"\",\"\",(G28+H28)/2))","v":""},{"$f":"IF(I28=\"\",\"\",IF(I28=0,\"I.G.\",I28*F28))","v":""}]
[{"$f":"'1'!A29","v":13},{"$f":"'1'!B29","v":"Spor"},null,null,null,24,null,null,"",""]
[{"$f":"'1'!A30","v":"Sum spesialøvelser:"},null,null,null,null,{"$f":"SUM(F27:F29)","v":39},null,null,null,{"$f":"IF(AND(J27=\"\",J28=\"\",J29=\"\"),\"\",SUM(J27:J29))","v":""}]
[{"$f":"'1'!A31","v":"Runderingsgruppen:"}]
[{"$f":"'1'!A32","v":"Øvelser:"},null,null,null,null,"Koeff.","Karakter","Karakter","Snitt","Poeng"]
[{"$f":"'1'!A33","v":11},{"$f":"'1'!B33","v":"Feltsøk"},null,null,null,10,null,null,{"$f":"IF(G33=\"\",\"\",IF(H33=\"\",\"\",(G33+H33)/2))","v":""},{"$f":"IF(I33=\"\",\"\",IF(I33=0,\"I.G.\",I33*F33))","v":""}]
[{"$f":"'1'!A34","v":12},{"$f":"'1'!B34","v":"Rundering"},null,null,null,{"$f":"'1'!F34","v":29},null,null,{"$f":"IF(G34=\"\",\"\",IF(H34=\"\",\"\",(G34+H34)/2))","v":""},{"$f":"IF(I34=\"\",\"\",IF(I34=0,\"I.G.\",I34*F34))","v":""}]
[{"$f":"'1'!A35","v":"Sum spesialøvelser:"},null,null,null,null,{"$f":"SUM(F33:F34)","v":39},null,null,null,{"$f":"IF(AND(J33=\"\",J34=\"\"),\"\",SUM(J33:J34))","v":""},null,"Godkjent",null,null,300,"poeng"]
[{"$f":"'1'!A36","v":"Rapportgruppen:"}]
[{"$f":"'1'!A37","v":"Start kl.:"},0,{"$f":"'1'!C37","v":"Ankomst kl.:"},0,{"$f":"'1'!E37:J37","v":"Anvendt tid:"},null,null,null,null,null,null,{"$f":"'1'!L37:N37","v":"Godkjent"},null,null,{"$f":"'1'!O37","v":325},{"$f":"'1'!P37","v":"poeng"}]
[{"$f":"'1'!A38","v":"B"},"00:00:00",{"$f":"'1'!C38","v":"A"},"00:00:00",{"$f":"SUM(B38,D38)","v":"00:00:00"},null,null,null,null,null,null,{"$f":"'1'!L38:N38","v":"- Derav i spesialøvelsene"},null,null,195,{"$f":"'1'!P38","v":"poeng"}]
[{"$f":"'1'!A39","v":"A"},"00:00:00",{"$f":"'1'!C39","v":"B"},"00:00:00",{"$f":"SUM(B39,D39)","v":"00:00:00"},null,null,null,null,null,null,"- Derav i lydighetsøvelsene",null,null,130,{"$f":"'1'!P39","v":"poeng"}]
[{"$f":"'1'!A40","v":"C"},"00:00:00",{"$f":"'1'!C40","v":"A"},"00:00:00",{"$f":"SUM(B40,D40)","v":"00:00:00"},null,null,null,null,null,null,{"$f":"'1'!L40:N40","v":"Cert/CACIT"},null,null,575,{"$f":"'1'!P40","v":"poeng"}]
[{"$f":"'1'!A41","v":"A"},"00:00:00",{"$f":"'1'!C41","v":"D"},"00:00:00",{"$f":"SUM(E37:J40)","v":"00:00:00"},null,null,null,null,null,null,{"$f":"'1'!L41:N41","v":"- Derav i spesialøvelsene"},null,null,312,{"$f":"'1'!P41","v":"poeng"}]
[{"$f":"'1'!A42","v":"Anvendt tid totalt:"},null,null,null,{"$f":"SUM(E38:J41)","v":"00:00:00"},null,null,null,null,null,null,{"$f":"'1'!L42:N42","v":"- Derav i lydighetsøvelsene"},null,null,208,{"$f":"'1'!P42","v":"poeng"}]
[{"$f":"'1'!A43","v":"Øvelser:"},null,null,null,null,{"$f":"'1'!F43","v":"Koeff."},{"$f":"'1'!G43","v":"Karakter"},{"$f":"'1'!H43","v":"Karakter"},"Snitt",{"$f":"'1'!J43","v":"Poeng"}]
[{"$f":"'1'!A44","v":11},{"$f":"'1'!B44","v":"Feltsøk"},null,null,null,10,null,null,{"$f":"IF(G44=\"\",\"\",IF(H44=\"\",\"\",(G44+H44)/2))","v":""},{"$f":"IF(I44=\"\",\"\",IF(I44=0,\"I.G.\",I44*F44))","v":""},null,null,null,null,{"$f":"'1'!O44:P44","v":"Poeng"}]
[{"$f":"'1'!A45","v":12},{"$f":"'1'!B45","v":"Rapport"},null,null,null,{"$f":"'1'!F45","v":29},null,null,{"$f":"IF(G45=\"\",\"\",IF(H45=\"\",\"\",(G45+H45)/2))","v":""},{"$f":"IF(I45=\"\",\"\",IF(I45=0,\"I.G.\",I45*F45))","v":""},null,{"$f":"'1'!L45:N45","v":"Sum Lydighet"},null,null,{"$f":"J24","v":0}]
[{"$f":"'1'!A46","v":"Sum spesialøvelser:"},null,null,null,null,{"$f":"SUM(F44:F45)","v":39},null,null,null,null,null,{"$f":"'1'!L46:N46","v":"Sum Spesialøvelser"},null,null,{"$f":"IF(Resultatskj!H4=\"Rundering\",J35,IF(Resultatskj!H4=\"Spor\",J30,IF(Resultatskj!H4=\"Rapport\",J46,\"\")))","v":""}]
[null,null,null,null,null,null,null,null,null,null,null,{"$f":"'1'!L47:N47","v":"Totalpoeng"},null,null,{"$f":"SUM(O45:P46)","v":0}]
[null,null,null,null,null,null,null,null,null,null,null,{"$f":"'1'!L48","v":"Ikke godkj."},{"$f":"'1'!M48","v":"Godkj."},null,{"$f":"'1'!O48","v":"Cert"},{"$f":"'1'!P48","v":"Plass"}]
[{"$f":"IF(Resultatskj!C3=\"\",\"\",Resultatskj!C3)","v":""},null,null,null,null,{"$f":"IF(Resultatskj!C4=\"\",\"\",Resultatskj!C4)","v":""},null,null,null,null,null,{"$f":"IF(OR(O47<O37,O46<O38,O45<O39,O47=\"\"),\"X\",\"\")","v":"X"},{"$f":"IF(AND(O47>=O37,O46>=O38,O45>=O39,L49=\"\"),\"X\",\"\")","v":""},null,{"$f":"IF(AND(O47>=575,O46>=311.99,O45>207.99,L49=\"\"),\"X\",\"\")","v":""},{"$f":"Resultatskj!A22","v":"-"}]
["Underskrift dommere",null,null,null,null,null,null,null,null,null,null,{"$f":"Resultatskj!K26","v":"B.Strand/A.Bakken 15.07.2015/19.06.2018"}]
[]
[{"$f":"IF(Resultatskj!$C$3=\"\",\"\",Resultatskj!$C$3)","v":""}]
[{"$f":"IF(Resultatskj!$C$4=\"\",\"\",Resultatskj!$C$4)","v":""}]