{"text_format":"1","workbook":"xlsx","n_sheets":17,"sheets":["Resultatskj","Rangering","1","2","3","4","5","6","7","8","9","10","11","12","13","14","15"],"not_rendered":{"charts":0,"images":3,"macros":1,"external_links":0,"defined_names":15,"comments":0,"pivot_tables":0},"unopened":[],"bounds":{"document_bytes":16777216,"sheet_cells":100000,"rows_first":2000,"rows_last":500,"rows_between":2000,"halvings":0,"cell_chars":16384,"cell_head_chars":4096},"cells_cut":0,"cells_raw":0,"read":"whole","date_system":"1900"}

{"sheet":"Resultatskj","index":0,"n_rows":26,"n_cols":13,"rows_kept":26,"cut":false,"hidden":false,"merged":[[25,10,25,12],[24,0,24,12],[23,0,23,12],[1,7,2,9],[5,12,6,12],[5,0,6,0],[5,5,6,5],[5,3,6,3],[5,2,6,2],[5,4,6,4],[0,0,0,12],[3,7,3,9],[3,10,3,11],[1,0,1,1],[2,0,2,1],[2,2,2,5],[3,2,3,5],[3,0,3,1],[1,2,1,3],[1,11,2,12]]}
["RESULTATSKJEMA KLASSE A - NM 2018"]
["Arrangør:",null,"Norsk Brukshundsports Forbund",null,"Prøve nr.:",null,"Sted:",null,null,null,"Dato:"]
["Dommer:"]
["Dommer:",null,null,null,null,null,"Gruppe:","Spor",null,null,"Klasse:",null,"A"]
[]
["Plass:","Kat.","Hundens navn:","Reg.nr.:","Rase:","Klubb:","Poeng","Poeng","Sum","Ikke","God-","Opp-","CERT"]
[null,"nr.:",null,null,null,null,"lydighet:","spes.øv.:","totalt:","godkj.","kjent","rykk"]
[{"$f":"IF(OR($C8=\"\",$J8=\"X\"),\"-\",RANK($I8,$I$8:$I$22,0))","v":"-"},{"$f":"IF(C8=\"\",\"\",1)","v":""},{"$f":"IF('1'!$M$3=\"\",\"\",'1'!$M$3)","v":""},{"$f":"IF('1'!$M$4=\"\",\"\",'1'!$M$4)","v":""},{"$f":"IF('1'!$M$5=\"\",\"\",'1'!$M$5)","v":""},{"$f":"IF('1'!$C$5=\"\",\"\",'1'!$C$5)","v":""},{"$f":"IF('1'!$O$43=0,\"\",'1'!$O$43)","v":""},{"$f":"IF('1'!$O$44=0,\"\",'1'!$O$44)","v":""},{"$f":"IF(C8=\"\",\"\",IF($J8=\"X\",('1'!$O$45*1),'1'!$O$45))","v":""},{"$f":"IF(OR(C8=\"\",K8=\"X\"),\"\",\"X\")","v":""},{"$f":"IF(C8=\"\",\"\",'1'!$M$47)","v":""},null,{"$f":"IF('1'!$O$47=\"\",\"\",'1'!$O$47)","v":""}]
[{"$f":"IF(OR($C9=\"\",$J9=\"X\"),\"-\",RANK($I9,$I$8:$I$22,0))","v":"-"},{"$f":"IF(C9=\"\",\"\",2)","v":""},{"$f":"IF('2'!$M$3=\"\",\"\",'2'!$M$3)","v":""},{"$f":"IF('2'!$M$4=\"\",\"\",'2'!$M$4)","v":""},{"$f":"IF('2'!$M$5=\"\",\"\",'2'!$M$5)","v":""},{"$f":"IF('2'!$C$5=\"\",\"\",'2'!$C$5)","v":""},{"$f":"IF('2'!$O$43=0,\"\",'2'!$O$43)","v":""},{"$f":"IF('2'!$O$44=0,\"\",'2'!$O$44)","v":""},{"$f":"IF(C9=\"\",\"\",IF($J9=\"X\",('2'!$O$45*1),'2'!$O$45))","v":""},{"$f":"IF(OR(C9=\"\",K9=\"X\"),\"\",\"X\")","v":""},{"$f":"IF(C9=\"\",\"\",'2'!$M$47)","v":""},null,{"$f":"IF('2'!$O$47=\"\",\"\",'2'!$O$47)","v":""}]
["-",{"$f":"IF(C10=\"\",\"\",3)","v":""},{"$f":"IF('3'!$M$3=\"\",\"\",'3'!$M$3)","v":""},{"$f":"IF('3'!$M$4=\"\",\"\",'3'!$M$4)","v":""},{"$f":"IF('3'!$M$5=\"\",\"\",'3'!$M$5)","v":""},{"$f":"IF('3'!$C$5=\"\",\"\",'3'!$C$5)","v":""},{"$f":"IF('3'!$O$43=0,\"\",'3'!$O$43)","v":""},{"$f":"IF('3'!$O$44=0,\"\",'3'!$O$44)","v":""},{"$f":"IF(C10=\"\",\"\",IF($J10=\"X\",('3'!$O$45*1),'3'!$O$45))","v":""},{"$f":"IF(OR(C10=\"\",K10=\"X\"),\"\",\"X\")","v":""},{"$f":"IF(C10=\"\",\"\",'3'!$M$47)","v":""},null,{"$f":"IF('3'!$O$47=\"\",\"\",'3'!$O$47)","v":""}]
["-",{"$f":"IF(C11=\"\",\"\",4)","v":""},{"$f":"IF('4'!$M$3=\"\",\"\",'4'!$M$3)","v":""},{"$f":"IF('4'!$M$4=\"\",\"\",'4'!$M$4)","v":""},{"$f":"IF('4'!$M$5=\"\",\"\",'4'!$M$5)","v":""},{"$f":"IF('4'!$C$5=\"\",\"\",'4'!$C$5)","v":""},{"$f":"IF('4'!$O$43=0,\"\",'4'!$O$43)","v":""},{"$f":"IF('4'!$O$44=0,\"\",'4'!$O$44)","v":""},{"$f":"IF(C11=\"\",\"\",IF($J11=\"X\",('4'!$O$45*1),'4'!$O$45))","v":""},{"$f":"IF(OR(C11=\"\",K11=\"X\"),\"\",\"X\")","v":""},{"$f":"IF(C11=\"\",\"\",'4'!$M$47)","v":""},null,{"$f":"IF('4'!$O$47=\"\",\"\",'4'!$O$47)","v":""}]
["-",{"$f":"IF(C12=\"\",\"\",5)","v":""},{"$f":"IF('5'!$M$3=\"\",\"\",'5'!$M$3)","v":""},{"$f":"IF('5'!$M$4=\"\",\"\",'5'!$M$4)","v":""},{"$f":"IF('5'!$M$5=\"\",\"\",'5'!$M$5)","v":""},{"$f":"IF('5'!$C$5=\"\",\"\",'5'!$C$5)","v":""},{"$f":"IF('5'!$O$43=0,\"\",'5'!$O$43)","v":""},{"$f":"IF('5'!$O$44=0,\"\",'5'!$O$44)","v":""},{"$f":"IF(C12=\"\",\"\",IF($J12=\"X\",('5'!$O$45*1),'5'!$O$45))","v":""},{"$f":"IF(OR(C12=\"\",K12=\"X\"),\"\",\"X\")","v":""},{"$f":"IF(C12=\"\",\"\",'5'!$M$47)","v":""},null,{"$f":"IF('5'!$O$47=\"\",\"\",'5'!$O$47)","v":""}]
["-",{"$f":"IF(C13=\"\",\"\",6)","v":""},{"$f":"IF('6'!$M$3=\"\",\"\",'6'!$M$3)","v":""},{"$f":"IF('6'!$M$4=\"\",\"\",'6'!$M$4)","v":""},{"$f":"IF('6'!$M$5=\"\",\"\",'6'!$M$5)","v":""},{"$f":"IF('6'!$C$5=\"\",\"\",'6'!$C$5)","v":""},{"$f":"IF('6'!$O$43=0,\"\",'6'!$O$43)","v":""},{"$f":"IF('6'!$O$44=0,\"\",'6'!$O$44)","v":""},{"$f":"IF(C13=\"\",\"\",IF($J13=\"X\",('6'!$O$45*1),'6'!$O$45))","v":""},{"$f":"IF(OR(C13=\"\",K13=\"X\"),\"\",\"X\")","v":""},{"$f":"IF(C13=\"\",\"\",'6'!$M$47)","v":""},null,{"$f":"IF('6'!$O$47=\"\",\"\",'6'!$O$47)","v":""}]
["-",{"$f":"IF(C14=\"\",\"\",7)","v":""},{"$f":"IF('7'!$M$3=\"\",\"\",'7'!$M$3)","v":""},{"$f":"IF('7'!$M$4=\"\",\"\",'7'!$M$4)","v":""},{"$f":"IF('7'!$M$5=\"\",\"\",'7'!$M$5)","v":""},{"$f":"IF('7'!$C$5=\"\",\"\",'7'!$C$5)","v":""},{"$f":"IF('7'!$O$43=0,\"\",'7'!$O$43)","v":""},{"$f":"IF('7'!$O$44=0,\"\",'7'!$O$44)","v":""},{"$f":"IF(C14=\"\",\"\",IF($J14=\"X\",('7'!$O$45*1),'7'!$O$45))","v":""},"",{"$f":"IF(C14=\"\",\"\",'7'!$M$47)","v":""},null,{"$f":"IF('7'!$O$47=\"\",\"\",'7'!$O$47)","v":""}]
["-",{"$f":"IF(C15=\"\",\"\",8)","v":""},{"$f":"IF('8'!$M$3=\"\",\"\",'8'!$M$3)","v":""},{"$f":"IF('8'!$M$4=\"\",\"\",'8'!$M$4)","v":""},{"$f":"IF('8'!$M$5=\"\",\"\",'8'!$M$5)","v":""},{"$f":"IF('8'!$C$5=\"\",\"\",'8'!$C$5)","v":""},{"$f":"IF('8'!$O$43=0,\"\",'8'!$O$43)","v":""},{"$f":"IF('8'!$O$44=0,\"\",'8'!$O$44)","v":""},{"$f":"IF(C15=\"\",\"\",IF($J15=\"X\",('8'!$O$45*1),'8'!$O$45))","v":""},"",{"$f":"IF(C15=\"\",\"\",'8'!$M$47)","v":""},null,{"$f":"IF('8'!$O$47=\"\",\"\",'8'!$O$47)","v":""}]
["-",{"$f":"IF(C16=\"\",\"\",9)","v":""},{"$f":"IF('9'!$M$3=\"\",\"\",'9'!$M$3)","v":""},{"$f":"IF('9'!$M$4=\"\",\"\",'9'!$M$4)","v":""},{"$f":"IF('9'!$M$5=\"\",\"\",'9'!$M$5)","v":""},{"$f":"IF('9'!$C$5=\"\",\"\",'9'!$C$5)","v":""},{"$f":"IF('9'!$O$43=0,\"\",'9'!$O$43)","v":""},{"$f":"IF('9'!$O$44=0,\"\",'9'!$O$44)","v":""},{"$f":"IF(C16=\"\",\"\",IF($J16=\"X\",('9'!$O$45*1),'9'!$O$45))","v":""},"",{"$f":"IF(C16=\"\",\"\",'9'!$M$47)","v":""},null,{"$f":"IF('9'!$O$47=\"\",\"\",'9'!$O$47)","v":""}]
["-",{"$f":"IF(C17=\"\",\"\",10)","v":""},{"$f":"IF('10'!$M$3=\"\",\"\",'10'!$M$3)","v":""},{"$f":"IF('10'!$M$4=\"\",\"\",'10'!$M$4)","v":""},{"$f":"IF('10'!$M$5=\"\",\"\",'10'!$M$5)","v":""},{"$f":"IF('10'!$C$5=\"\",\"\",'10'!$C$5)","v":""},{"$f":"IF('10'!$O$43=0,\"\",'10'!$O$43)","v":""},{"$f":"IF('10'!$O$44=0,\"\",'10'!$O$44)","v":""},{"$f":"IF(C17=\"\",\"\",IF($J17=\"X\",('10'!$O$45*1),'10'!$O$45))","v":""},"",{"$f":"IF(C17=\"\",\"\",'10'!$M$47)","v":""},null,{"$f":"IF('10'!$O$47=\"\",\"\",'10'!$O$47)","v":""}]
["-",{"$f":"IF(C18=\"\",\"\",11)","v":""},{"$f":"IF('11'!$M$3=\"\",\"\",'11'!$M$3)","v":""},{"$f":"IF('11'!$M$4=\"\",\"\",'11'!$M$4)","v":""},{"$f":"IF('11'!$M$5=\"\",\"\",'11'!$M$5)","v":""},{"$f":"IF('11'!$C$5=\"\",\"\",'11'!$C$5)","v":""},{"$f":"IF('11'!$O$43=0,\"\",'11'!$O$43)","v":""},{"$f":"IF('11'!$O$44=0,\"\",'11'!$O$44)","v":""},{"$f":"IF(C18=\"\",\"\",IF($J18=\"X\",('11'!$O$45*1),'11'!$O$45))","v":""},"",{"$f":"IF(C18=\"\",\"\",'11'!$M$47)","v":""},null,{"$f":"IF('11'!$O$47=\"\",\"\",'11'!$O$47)","v":""}]
["-",{"$f":"IF(C19=\"\",\"\",12)","v":""},{"$f":"IF('12'!$M$3=\"\",\"\",'12'!$M$3)","v":""},{"$f":"IF('12'!$M$4=\"\",\"\",'12'!$M$4)","v":""},{"$f":"IF('12'!$M$5=\"\",\"\",'12'!$M$5)","v":""},{"$f":"IF('12'!$C$5=\"\",\"\",'12'!$C$5)","v":""},{"$f":"IF('12'!$O$43=0,\"\",'12'!$O$43)","v":""},{"$f":"IF('12'!$O$44=0,\"\",'12'!$O$44)","v":""},{"$f":"IF(C19=\"\",\"\",IF($J19=\"X\",('12'!$O$45*1),'12'!$O$45))","v":""},"",{"$f":"IF(C19=\"\",\"\",'12'!$M$47)","v":""},null,{"$f":"IF('12'!$O$47=\"\",\"\",'12'!$O$47)","v":""}]
["-",{"$f":"IF(C20=\"\",\"\",13)","v":""},{"$f":"IF('13'!$M$3=\"\",\"\",'13'!$M$3)","v":""},{"$f":"IF('13'!$M$4=\"\",\"\",'13'!$M$4)","v":""},{"$f":"IF('13'!$M$5=\"\",\"\",'13'!$M$5)","v":""},{"$f":"IF('13'!$C$5=\"\",\"\",'13'!$C$5)","v":""},{"$f":"IF('13'!$O$43=0,\"\",'13'!$O$43)","v":""},{"$f":"IF('13'!$O$44=0,\"\",'13'!$O$44)","v":""},{"$f":"IF(C20=\"\",\"\",IF($J20=\"X\",('13'!$O$45*1),'13'!$O$45))","v":""},"",{"$f":"IF(C20=\"\",\"\",'13'!$M$47)","v":""},null,{"$f":"IF('13'!$O$47=\"\",\"\",'13'!$O$47)","v":""}]
["-",{"$f":"IF(C21=\"\",\"\",14)","v":""},{"$f":"IF('14'!$M$3=\"\",\"\",'14'!$M$3)","v":""},{"$f":"IF('14'!$M$4=\"\",\"\",'14'!$M$4)","v":""},{"$f":"IF('14'!$M$5=\"\",\"\",'14'!$M$5)","v":""},{"$f":"IF('14'!$C$5=\"\",\"\",'14'!$C$5)","v":""},{"$f":"IF('14'!$O$43=0,\"\",'14'!$O$43)","v":""},{"$f":"IF('14'!$O$44=0,\"\",'14'!$O$44)","v":""},{"$f":"IF(C21=\"\",\"\",IF($J21=\"X\",('14'!$O$45*1),'14'!$O$45))","v":""},"",{"$f":"IF(C21=\"\",\"\",'14'!$M$47)","v":""},null,{"$f":"IF('14'!$O$47=\"\",\"\",'14'!$O$47)","v":""}]
["-",{"$f":"IF(C22=\"\",\"\",15)","v":""},{"$f":"IF('15'!$M$3=\"\",\"\",'15'!$M$3)","v":""},{"$f":"IF('14'!$M$4=\"\",\"\",'14'!$M$4)","v":""},{"$f":"IF('15'!$M$5=\"\",\"\",'15'!$M$5)","v":""},{"$f":"IF('15'!$C$5=\"\",\"\",'15'!$C$5)","v":""},{"$f":"IF('15'!$O$43=0,\"\",'15'!$O$43)","v":""},{"$f":"IF('15'!$O$44=0,\"\",'15'!$O$44)","v":""},{"$f":"IF(C22=\"\",\"\",IF($J22=\"X\",('15'!$O$45*1),'15'!$O$45))","v":""},"",{"$f":"IF(C22=\"\",\"\",'15'!$M$47)","v":""},null,{"$f":"IF('15'!$O$47=\"\",\"\",'15'!$O$47)","v":""}]
[]
["Underskrift dommere:"]
[]
["Original til NKK. Kopi til NBF og arrangørklubben.",null,null,null,null,null,null,null,null,null,"B.Strand/A.Bakken 15.07.2015/19.06.2018"]

{"sheet":"Rangering","index":1,"n_rows":21,"n_cols":17,"rows_kept":21,"cut":false,"hidden":false,"merged":[[0,0,0,16],[2,16,3,16],[20,15,20,16],[2,2,3,2],[2,0,3,0],[2,3,3,3],[2,4,3,4],[2,5,3,5],[2,6,3,6]]}
["RESULTATLISTE - NM SPOR 2018"]
[]
["Plass:","Kat.","Fører","Hundens navn:","Reg.nr.:","Rase:","Klubb:","Poeng","Poeng","Poeng","Poeng","Poeng","Sum","Ikke","God-","Opp-","CERT"]
[null,"nr.:",null,null,null,null,null,"lydighet:","spesial","feltsøk","oppsøk","spor","totalt:","godkj.","kjent","rykk"]
[{"$f":"IF(OR($D5=\"\",$N5=\"X\"),\"-\",RANK($M5,$M$5:$M$19,0))","v":"-"},{"$f":"IF(D5=\"\",\"\",1)","v":""},{"$f":"IF('1'!$M$4=\"\",\"\",'1'!$C$4)","v":""},{"$f":"IF('1'!$M$3=\"\",\"\",'1'!$M$3)","v":""},{"$f":"IF('1'!$M$4=\"\",\"\",'1'!$M$4)","v":""},{"$f":"IF('1'!$M$5=\"\",\"\",'1'!$M$5)","v":""},{"$f":"IF('1'!$C$5=\"\",\"\",'1'!$C$5)","v":""},{"$f":"IF('1'!$O$43=0,\"\",'1'!$O$43)","v":""},{"$f":"IF('1'!$O$44=0,\"\",'1'!$O$44)","v":""},{"$f":"IF('1'!$J$25=0,\"\",'1'!$J$25)","v":""},{"$f":"IF('1'!$J$26=0,\"\",'1'!$J$26)","v":""},{"$f":"IF('1'!$J$27=0,\"\",'1'!$J$27)","v":""},{"$f":"IF(D5=\"\",\"\",IF($N5=\"X\",('1'!$O$45*1),'1'!$O$45))","v":""},{"$f":"IF(OR(D5=\"\",O5=\"X\"),\"\",\"X\")","v":""},{"$f":"IF(D5=\"\",\"\",'1'!$M$47)","v":""},null,{"$f":"IF('1'!$O$47=\"\",\"\",'1'!$O$47)","v":""}]
["-",{"$f":"IF(D6=\"\",\"\",2)","v":""},{"$f":"IF('2'!$M$4=\"\",\"\",'2'!$C$4)","v":""},{"$f":"IF('2'!$M$3=\"\",\"\",'2'!$M$3)","v":""},{"$f":"IF('2'!$M$4=\"\",\"\",'2'!$M$4)","v":""},{"$f":"IF('2'!$M$5=\"\",\"\",'2'!$M$5)","v":""},{"$f":"IF('2'!$C$5=\"\",\"\",'2'!$C$5)","v":""},{"$f":"IF('2'!$O$43=0,\"\",'2'!$O$43)","v":""},{"$f":"IF('2'!$O$44=0,\"\",'2'!$O$44)","v":""},{"$f":"IF('2'!$J$25=0,\"\",'2'!$J$25)","v":""},{"$f":"IF('2'!$J$26=0,\"\",'2'!$J$26)","v":""},{"$f":"IF('2'!$J$27=0,\"\",'2'!$J$27)","v":""},{"$f":"IF(D6=\"\",\"\",IF($N6=\"X\",('2'!$O$45*1),'2'!$O$45))","v":""},"",{"$f":"IF(D6=\"\",\"\",'2'!$M$47)","v":""},null,{"$f":"IF('2'!$O$47=\"\",\"\",'2'!$O$47)","v":""}]
["-",{"$f":"IF(D7=\"\",\"\",3)","v":""},{"$f":"IF('3'!$M$4=\"\",\"\",'3'!$C$4)","v":""},{"$f":"IF('3'!$M$3=\"\",\"\",'3'!$M$3)","v":""},{"$f":"IF('3'!$M$4=\"\",\"\",'3'!$M$4)","v":""},{"$f":"IF('3'!$M$5=\"\",\"\",'3'!$M$5)","v":""},{"$f":"IF('3'!$C$5=\"\",\"\",'3'!$C$5)","v":""},{"$f":"IF('3'!$O$43=0,\"\",'3'!$O$43)","v":""},{"$f":"IF('3'!$O$44=0,\"\",'3'!$O$44)","v":""},{"$f":"IF('3'!$J$25=0,\"\",'3'!$J$25)","v":""},{"$f":"IF('3'!$J$26=0,\"\",'3'!$J$26)","v":""},{"$f":"IF('3'!$J$27=0,\"\",'3'!$J$27)","v":""},{"$f":"IF(D7=\"\",\"\",IF($N7=\"X\",('3'!$O$45*1),'3'!$O$45))","v":""},"",{"$f":"IF(D7=\"\",\"\",'3'!$M$47)","v":""},null,{"$f":"IF('3'!$O$47=\"\",\"\",'3'!$O$47)","v":""}]
["-",{"$f":"IF(D8=\"\",\"\",4)","v":""},{"$f":"IF('4'!$M$4=\"\",\"\",'4'!$C$4)","v":""},{"$f":"IF('4'!$M$3=\"\",\"\",'4'!$M$3)","v":""},{"$f":"IF('4'!$M$4=\"\",\"\",'4'!$M$4)","v":""},{"$f":"IF('4'!$M$5=\"\",\"\",'4'!$M$5)","v":""},{"$f":"IF('4'!$C$5=\"\",\"\",'4'!$C$5)","v":""},{"$f":"IF('4'!$O$43=0,\"\",'4'!$O$43)","v":""},{"$f":"IF('4'!$O$44=0,\"\",'4'!$O$44)","v":""},{"$f":"IF('4'!$J$25=0,\"\",'4'!$J$25)","v":""},{"$f":"IF('4'!$J$26=0,\"\",'4'!$J$26)","v":""},{"$f":"IF('4'!$J$27=0,\"\",'4'!$J$27)","v":""},{"$f":"IF(D8=\"\",\"\",IF($N8=\"X\",('4'!$O$45*1),'4'!$O$45))","v":""},"",{"$f":"IF(D8=\"\",\"\",'4'!$M$47)","v":""},null,{"$f":"IF('4'!$O$47=\"\",\"\",'4'!$O$47)","v":""}]
["-",{"$f":"IF(D9=\"\",\"\",5)","v":""},{"$f":"IF('5'!$M$4=\"\",\"\",'5'!$C$4)","v":""},{"$f":"IF('5'!$M$3=\"\",\"\",'5'!$M$3)","v":""},{"$f":"IF('5'!$M$4=\"\",\"\",'5'!$M$4)","v":""},{"$f":"IF('5'!$M$5=\"\",\"\",'5'!$M$5)","v":""},{"$f":"IF('5'!$C$5=\"\",\"\",'5'!$C$5)","v":""},{"$f":"IF('5'!$O$43=0,\"\",'5'!$O$43)","v":""},{"$f":"IF('5'!$O$44=0,\"\",'5'!$O$44)","v":""},{"$f":"IF('5'!$J$25=0,\"\",'5'!$J$25)","v":""},{"$f":"IF('5'!$J$26=0,\"\",'5'!$J$26)","v":""},{"$f":"IF('5'!$J$27=0,\"\",'5'!$J$27)","v":""},{"$f":"IF(D9=\"\",\"\",IF($N9=\"X\",('5'!$O$45*1),'5'!$O$45))","v":""},"",{"$f":"IF(D9=\"\",\"\",'5'!$M$47)","v":""},null,{"$f":"IF('5'!$O$47=\"\",\"\",'5'!$O$47)","v":""}]
["-",{"$f":"IF(D10=\"\",\"\",6)","v":""},{"$f":"IF('6'!$M$4=\"\",\"\",'6'!$C$4)","v":""},{"$f":"IF('6'!$M$3=\"\",\"\",'6'!$M$3)","v":""},{"$f":"IF('6'!$M$4=\"\",\"\",'6'!$M$4)","v":""},{"$f":"IF('6'!$M$5=\"\",\"\",'6'!$M$5)","v":""},{"$f":"IF('6'!$C$5=\"\",\"\",'6'!$C$5)","v":""},{"$f":"IF('6'!$O$43=0,\"\",'6'!$O$43)","v":""},{"$f":"IF('6'!$O$44=0,\"\",'6'!$O$44)","v":""},{"$f":"IF('6'!$J$25=0,\"\",'6'!$J$25)","v":""},{"$f":"IF('6'!$J$26=0,\"\",'6'!$J$26)","v":""},{"$f":"IF('6'!$J$27=0,\"\",'6'!$J$27)","v":""},{"$f":"IF(D10=\"\",\"\",IF($N10=\"X\",('6'!$O$45*1),'6'!$O$45))","v":""},"",{"$f":"IF(D10=\"\",\"\",'6'!$M$47)","v":""},null,{"$f":"IF('6'!$O$47=\"\",\"\",'6'!$O$47)","v":""}]
["-",{"$f":"IF(D11=\"\",\"\",7)","v":""},{"$f":"IF('7'!$M$4=\"\",\"\",'7'!$C$4)","v":""},{"$f":"IF('7'!$M$3=\"\",\"\",'7'!$M$3)","v":""},{"$f":"IF('7'!$M$4=\"\",\"\",'7'!$M$4)","v":""},{"$f":"IF('7'!$M$5=\"\",\"\",'7'!$M$5)","v":""},{"$f":"IF('7'!$C$5=\"\",\"\",'7'!$C$5)","v":""},{"$f":"IF('7'!$O$43=0,\"\",'7'!$O$43)","v":""},{"$f":"IF('7'!$O$44=0,\"\",'7'!$O$44)","v":""},{"$f":"IF('7'!$J$25=0,\"\",'7'!$J$25)","v":""},{"$f":"IF('7'!$J$26=0,\"\",'7'!$J$26)","v":""},{"$f":"IF('7'!$J$27=0,\"\",'7'!$J$27)","v":""},{"$f":"IF(D11=\"\",\"\",IF($N11=\"X\",('7'!$O$45*1),'7'!$O$45))","v":""},"",{"$f":"IF(D11=\"\",\"\",'7'!$M$47)","v":""},null,{"$f":"IF('7'!$O$47=\"\",\"\",'7'!$O$47)","v":""}]
["-",{"$f":"IF(D12=\"\",\"\",8)","v":""},{"$f":"IF('8'!$M$4=\"\",\"\",'8'!$C$4)","v":""},{"$f":"IF('8'!$M$3=\"\",\"\",'8'!$M$3)","v":""},{"$f":"IF('8'!$M$4=\"\",\"\",'8'!$M$4)","v":""},{"$f":"IF('8'!$M$5=\"\",\"\",'8'!$M$5)","v":""},{"$f":"IF('8'!$C$5=\"\",\"\",'8'!$C$5)","v":""},{"$f":"IF('8'!$O$43=0,\"\",'8'!$O$43)","v":""},{"$f":"IF('8'!$O$44=0,\"\",'8'!$O$44)","v":""},{"$f":"IF('8'!$J$25=0,\"\",'8'!$J$25)","v":""},{"$f":"IF('8'!$J$26=0,\"\",'8'!$J$26)","v":""},{"$f":"IF('8'!$J$27=0,\"\",'8'!$J$27)","v":""},{"$f":"IF(D12=\"\",\"\",IF($N12=\"X\",('8'!$O$45*1),'8'!$O$45))","v":""},"",{"$f":"IF(D12=\"\",\"\",'8'!$M$47)","v":""},null,{"$f":"IF('8'!$O$47=\"\",\"\",'8'!$O$47)","v":""}]
["-",{"$f":"IF(D13=\"\",\"\",9)","v":""},{"$f":"IF('9'!$M$4=\"\",\"\",'9'!$C$4)","v":""},{"$f":"IF('9'!$M$3=\"\",\"\",'9'!$M$3)","v":""},{"$f":"IF('9'!$M$4=\"\",\"\",'9'!$M$4)","v":""},{"$f":"IF('9'!$M$5=\"\",\"\",'9'!$M$5)","v":""},{"$f":"IF('9'!$C$5=\"\",\"\",'9'!$C$5)","v":""},{"$f":"IF('9'!$O$43=0,\"\",'9'!$O$43)","v":""},{"$f":"IF('9'!$O$44=0,\"\",'9'!$O$44)","v":""},{"$f":"IF('9'!$J$25=0,\"\",'9'!$J$25)","v":""},{"$f":"IF('9'!$J$26=0,\"\",'9'!$J$26)","v":""},{"$f":"IF('9'!$J$27=0,\"\",'9'!$J$27)","v":""},{"$f":"IF(D13=\"\",\"\",IF($N13=\"X\",('9'!$O$45*1),'9'!$O$45))","v":""},"",{"$f":"IF(D13=\"\",\"\",'9'!$M$47)","v":""},null,{"$f":"IF('9'!$O$47=\"\",\"\",'9'!$O$47)","v":""}]
["-",{"$f":"IF(D14=\"\",\"\",10)","v":""},{"$f":"IF('10'!$M$4=\"\",\"\",'10'!$C$4)","v":""},{"$f":"IF('10'!$M$3=\"\",\"\",'10'!$M$3)","v":""},{"$f":"IF('10'!$M$4=\"\",\"\",'10'!$M$4)","v":""},{"$f":"IF('10'!$M$5=\"\",\"\",'10'!$M$5)","v":""},{"$f":"IF('10'!$C$5=\"\",\"\",'10'!$C$5)","v":""},{"$f":"IF('10'!$O$43=0,\"\",'10'!$O$43)","v":""},{"$f":"IF('10'!$O$44=0,\"\",'10'!$O$44)","v":""},{"$f":"IF('10'!$J$25=0,\"\",'10'!$J$25)","v":""},{"$f":"IF('10'!$J$26=0,\"\",'10'!$J$26)","v":""},{"$f":"IF('10'!$J$27=0,\"\",'10'!$J$27)","v":""},{"$f":"IF(D14=\"\",\"\",IF($N14=\"X\",('10'!$O$45*1),'10'!$O$45))","v":""},"",{"$f":"IF(D14=\"\",\"\",'10'!$M$47)","v":""},null,{"$f":"IF('10'!$O$47=\"\",\"\",'10'!$O$47)","v":""}]
["-",{"$f":"IF(D15=\"\",\"\",11)","v":""},{"$f":"IF('11'!$M$4=\"\",\"\",'11'!$C$4)","v":""},{"$f":"IF('11'!$M$3=\"\",\"\",'11'!$M$3)","v":""},{"$f":"IF('11'!$M$4=\"\",\"\",'11'!$M$4)","v":""},{"$f":"IF('11'!$M$5=\"\",\"\",'11'!$M$5)","v":""},{"$f":"IF('11'!$C$5=\"\",\"\",'11'!$C$5)","v":""},{"$f":"IF('11'!$O$43=0,\"\",'11'!$O$43)","v":""},{"$f":"IF('11'!$O$44=0,\"\",'11'!$O$44)","v":""},{"$f":"IF('11'!$J$25=0,\"\",'11'!$J$25)","v":""},{"$f":"IF('11'!$J$26=0,\"\",'11'!$J$26)","v":""},{"$f":"IF('11'!$J$27=0,\"\",'11'!$J$27)","v":""},{"$f":"IF(D15=\"\",\"\",IF($N15=\"X\",('11'!$O$45*1),'11'!$O$45))","v":""},"",{"$f":"IF(D15=\"\",\"\",'11'!$M$47)","v":""},null,{"$f":"IF('11'!$O$47=\"\",\"\",'11'!$O$47)","v":""}]
["-",{"$f":"IF(D16=\"\",\"\",12)","v":""},{"$f":"IF('12'!$M$4=\"\",\"\",'12'!$C$4)","v":""},{"$f":"IF('12'!$M$3=\"\",\"\",'12'!$M$3)","v":""},{"$f":"IF('12'!$M$4=\"\",\"\",'12'!$M$4)","v":""},{"$f":"IF('12'!$M$5=\"\",\"\",'12'!$M$5)","v":""},{"$f":"IF('12'!$C$5=\"\",\"\",'12'!$C$5)","v":""},{"$f":"IF('12'!$O$43=0,\"\",'12'!$O$43)","v":""},{"$f":"IF('12'!$O$44=0,\"\",'12'!$O$44)","v":""},{"$f":"IF('12'!$J$25=0,\"\",'12'!$J$25)","v":""},{"$f":"IF('12'!$J$26=0,\"\",'12'!$J$26)","v":""},{"$f":"IF('12'!$J$27=0,\"\",'12'!$J$27)","v":""},{"$f":"IF(D16=\"\",\"\",IF($N16=\"X\",('12'!$O$45*1),'12'!$O$45))","v":""},"",{"$f":"IF(D16=\"\",\"\",'12'!$M$47)","v":""},null,{"$f":"IF('12'!$O$47=\"\",\"\",'12'!$O$47)","v":""}]
["-",{"$f":"IF(D17=\"\",\"\",13)","v":""},{"$f":"IF('13'!$M$4=\"\",\"\",'13'!$C$4)","v":""},{"$f":"IF('13'!$M$3=\"\",\"\",'13'!$M$3)","v":""},{"$f":"IF('13'!$M$4=\"\",\"\",'13'!$M$4)","v":""},{"$f":"IF('13'!$M$5=\"\",\"\",'13'!$M$5)","v":""},{"$f":"IF('13'!$C$5=\"\",\"\",'13'!$C$5)","v":""},{"$f":"IF('13'!$O$43=0,\"\",'13'!$O$43)","v":""},{"$f":"IF('13'!$O$44=0,\"\",'13'!$O$44)","v":""},{"$f":"IF('13'!$J$25=0,\"\",'13'!$J$25)","v":""},{"$f":"IF('13'!$J$26=0,\"\",'13'!$J$26)","v":""},{"$f":"IF('13'!$J$27=0,\"\",'13'!$J$27)","v":""},{"$f":"IF(D17=\"\",\"\",IF($N17=\"X\",('13'!$O$45*1),'13'!$O$45))","v":""},"",{"$f":"IF(D17=\"\",\"\",'13'!$M$47)","v":""},null,{"$f":"IF('13'!$O$47=\"\",\"\",'13'!$O$47)","v":""}]
["-",{"$f":"IF(D18=\"\",\"\",14)","v":""},{"$f":"IF('14'!$M$4=\"\",\"\",'14'!$C$4)","v":""},{"$f":"IF('14'!$M$3=\"\",\"\",'14'!$M$3)","v":""},{"$f":"IF('14'!$M$4=\"\",\"\",'14'!$M$4)","v":""},{"$f":"IF('14'!$M$5=\"\",\"\",'14'!$M$5)","v":""},{"$f":"IF('14'!$C$5=\"\",\"\",'14'!$C$5)","v":""},{"$f":"IF('14'!$O$43=0,\"\",'14'!$O$43)","v":""},{"$f":"IF('14'!$O$44=0,\"\",'14'!$O$44)","v":""},{"$f":"IF('14'!$J$25=0,\"\",'14'!$J$25)","v":""},{"$f":"IF('14'!$J$26=0,\"\",'14'!$J$26)","v":""},{"$f":"IF('14'!$J$27=0,\"\",'14'!$J$27)","v":""},{"$f":"IF(D18=\"\",\"\",IF($N18=\"X\",('14'!$O$45*1),'14'!$O$45))","v":""},"",{"$f":"IF(D18=\"\",\"\",'14'!$M$47)","v":""},null,{"$f":"IF('14'!$O$47=\"\",\"\",'14'!$O$47)","v":""}]
["-",{"$f":"IF(D19=\"\",\"\",15)","v":""},{"$f":"IF('15'!$M$4=\"\",\"\",'15'!$C$4)","v":""},{"$f":"IF('15'!$M$3=\"\",\"\",'15'!$M$3)","v":""},{"$f":"IF('14'!$M$4=\"\",\"\",'14'!$M$4)","v":""},{"$f":"IF('15'!$M$5=\"\",\"\",'15'!$M$5)","v":""},{"$f":"IF('15'!$C$5=\"\",\"\",'15'!$C$5)","v":""},{"$f":"IF('15'!$O$43=0,\"\",'15'!$O$43)","v":""},{"$f":"IF('15'!$O$44=0,\"\",'15'!$O$44)","v":""},{"$f":"IF('15'!$J$25=0,\"\",'15'!$J$25)","v":""},{"$f":"IF('15'!$J$26=0,\"\",'15'!$J$26)","v":""},{"$f":"IF('15'!$J$27=0,\"\",'15'!$J$27)","v":""},{"$f":"IF(D19=\"\",\"\",IF($N19=\"X\",('15'!$O$45*1),'15'!$O$45))","v":""},"",{"$f":"IF(D19=\"\",\"\",'15'!$M$47)","v":""},null,{"$f":"IF('15'!$O$47=\"\",\"\",'15'!$O$47)","v":""}]
[]
[null,null,null,null,null,null,null,null,null,null,null,null,null,null,null,"B.Strand 15.07.2015"]

{"sheet":"1","index":2,"n_rows":51,"n_cols":16,"rows_kept":51,"cut":false,"hidden":false,"merged":[[49,0,49,9],[50,0,50,9],[46,12,46,13],[42,14,42,15],[43,14,43,15],[49,11,49,15],[47,11,47,15],[44,14,44,15],[42,1,42,4],[44,0,46,9],[47,0,47,9],[45,12,45,13],[44,11,44,13],[42,11,42,13],[43,11,43,13],[43,0,43,4],[41,14,41,15],[41,11,41,13],[41,1,41,4],[36,11,36,13],[24,1,24,4],[33,0,33,15],[35,11,35,13],[37,11,37,13],[38,11,38,13],[36,4,36,9],[37,4,37,9],[40,0,40,4],[32,0,32,4],[30,1,30,4],[31,1,31,4],[39,11,39,13],[21,0,21,4],[35,4,35,9],[25,10,25,15],[38,4,38,9],[34,11,34,13],[23,0,23,4],[39,0,39,3],[34,4,34,9],[25,1,25,4],[26,1,26,4],[29,0,29,4],[34,0,34,1],[34,2,34,3],[39,4,39,9],[2,12,2,15],[0,5,0,15],[1,10,1,12],[1,2,1,5],[29,10,29,15],[28,0,28,15],[27,10,27,15],[4,12,4,15],[10,10,10,15],[2,10,2,11],[3,10,3,11],[2,0,2,1],[24,10,24,15],[12,1,12,4],[15,10,15,15],[15,1,15,4],[32,10,32,15],[31,10,31,15],[26,10,26,15],[23,10,23,15],[30,10,30,15],[0,2,0,4],[1,0,1,1],[3,0,3,1],[4,0,4,1],[27,0,27,4],[11,1,11,4],[4,2,4,9],[13,1,13,4],[2,2,2,9],[22,0,22,15],[9,0,9,15],[13,10,13,15],[16,10,16,15],[21,10,21,15],[14,1,14,4],[14,10,14,15],[3,12,3,15],[20,1,20,4],[20,10,20,15],[18,1,18,4],[18,10,18,15],[19,1,19,4],[19,10,19,15],[4,10,4,11],[3,2,3,9],[10,0,10,4],[11,10,11,15],[12,10,12,15],[17,1,17,4],[17,10,17,15],[16,1,16,4]]}
[null,null,null,null,null,"Kl. A - DOMMERPROTOKOLL"]
[{"$f":"Resultatskj!K2","v":"Dato:"},null,{"$f":"IF(Resultatskj!L2=\"\",\"\",Resultatskj!L2)","v":""},null,null,null,null,null,null,{"$f":"Resultatskj!G4","v":"Gruppe:"},{"$f":"IF(Resultatskj!H4=\"\",\"\",Resultatskj!H4)","v":"Spor"},null,null,null,"Katalog nr.",{"$f":"Resultatskj!B8","v":""}]
[{"$f":"Resultatskj!A2","v":"Arrangør:"},null,{"$f":"IF(Resultatskj!$C$2=\"\",\"\",Resultatskj!$C$2)","v":"Norsk Brukshundsports Forbund"},null,null,null,null,null,null,null,{"$f":"Resultatskj!C6","v":"Hundens navn:"}]
["Fører:",null,null,null,null,null,null,null,null,null,{"$f":"Resultatskj!D6","v":"Reg.nr.:"}]
[{"$f":"Resultatskj!F6","v":"Klubb:"},null,null,null,null,null,null,null,null,null,{"$f":"Resultatskj!E6","v":"Rase:"}]
[]
[null,"Klasse:",null,"Liten",null,null,null,null,null,"Middels",null,null,"Stor"]
[]
[]
["Lydighet:"]
["Øvelser:",null,null,null,null,"Koeff.","Karakter","Karakter","Snitt","Poeng"]
[1,"Fri ved foten",null,null,null,3,null,null,{"$f":"IF(G12=\"\",\"\",IF(H12=\"\",\"\",(G12+H12)/2))","v":""},{"$f":"IF(I12=\"\",\"\",IF(I12=0,\"I.G.\",I12*F12))","v":""}]
[2,"Innkalling m/stå og dekk",null,null,null,3,null,null,{"$f":"IF(G13=\"\",\"\",IF(H13=\"\",\"\",(G13+H13)/2))","v":""},{"$f":"IF(I13=\"\",\"\",IF(I13=0,\"I.G.\",I13*F13))","v":""}]
[3,"Fremadsending",null,null,null,3,null,null,"",""]
[4,"Kryp",null,null,null,3,null,null,"",""]
[5,"Hals på kommando",null,null,null,2,null,null,"",""]
[6,"Apportering metallapport",null,null,null,3,null,null,"",""]
[7,"Apportering tung gjenstand",null,null,null,3,null,null,"",""]
[8,"Fritt hopp over hinder",null,null,null,2,null,null,"",""]
[9,"Stigeklatring",null,null,null,2,null,null,"",""]
[10,"Fellesdekk",null,null,null,2,null,null,"",""]
["Sum lydighet:",null,null,null,null,{"$f":"SUM(F12:F21)","v":26},null,null,null,{"$f":"SUM(J12:J21)","v":0}]
["Sporgruppen:"]
["Øvelser:",null,null,null,null,"Koeff.","Karakter","Karakter","Snitt","Poeng"]
[11,"Feltsøk",null,null,null,10,null,null,{"$f":"IF(G25=\"\",\"\",IF(H25=\"\",\"\",(G25+H25)/2))","v":""},{"$f":"IF(I25=\"\",\"\",IF(I25=0,\"I.G.\",I25*F25))","v":""}]
[12,"Sporoppsøk",null,null,null,5,null,null,{"$f":"IF(G26=\"\",\"\",IF(H26=\"\",\"\",(G26+H26)/2))","v":""},{"$f":"IF(I26=\"\",\"\",IF(I26=0,\"I.G.\",I26*F26))","v":""}]
[13,"Spor",null,null,null,24,null,null,"",""]
["Sum spesialøvelser:",null,null,null,null,{"$f":"SUM(F25:F27)","v":39},null,null,null,{"$f":"IF(AND(J25=\"\",J26=\"\",J27=\"\"),\"\",SUM(J25:J27))","v":""}]
["Runderingsgruppen:"]
[{"$f":"$A$11","v":"Øvelser:"},null,null,null,null,"Koeff.","Karakter","Karakter","Snitt","Poeng"]
[11,"Feltsøk",null,null,null,10,null,null,{"$f":"IF(G31=\"\",\"\",IF(H31=\"\",\"\",(G31+H31)/2))","v":""},{"$f":"IF(I31=\"\",\"\",IF(I31=0,\"I.G.\",I31*F31))","v":""}]
[12,"Rundering",null,null,null,29,null,null,{"$f":"IF(G32=\"\",\"\",IF(H32=\"\",\"\",(G32+H32)/2))","v":""},{"$f":"IF(I32=\"\",\"\",IF(I32=0,\"I.G.\",I32*F32))","v":""}]
["Sum spesialøvelser:",null,null,null,null,{"$f":"SUM(F31:F32)","v":39},null,null,null,{"$f":"IF(AND(J31=\"\",J32=\"\"),\"\",SUM(J31:J32))","v":""}]
["Rapportgruppen:",null,null,null,null,null,null,null,null,null,null,"Godkjent",null,null,300,"poeng"]
["Start kl.:",null,"Ankomst kl.:",null,"Anvendt tid:",null,null,null,null,null,null,"Godkjent",null,null,325,"poeng"]
["B","00:00:00","A","00:00:00",{"$f":"SUM(B36,D36)","v":"00:00:00"},null,null,null,null,null,null,"- Derav i spesialøvelsene",null,null,195,"poeng"]
["A","00:00:00","B","00:00:00",{"$f":"SUM(B37,D37)","v":"00:00:00"},null,null,null,null,null,null,"- Derav i lydighetsøvelsene",null,null,130,"poeng"]
["C","00:00:00","A","00:00:00",{"$f":"SUM(B38,D38)","v":"00:00:00"},null,null,null,null,null,null,"Cert/CACIT",null,null,575,"poeng"]
["A","00:00:00","D","00:00:00",{"$f":"SUM(B39,D39)","v":"00:00:00"},null,null,null,null,null,null,"- Derav i spesialøvelsene",null,null,312,"poeng"]
["Anvendt tid totalt:",null,null,null,{"$f":"SUM(E36:J39)","v":"00:00:00"},null,null,null,null,null,null,"- Derav i lydighetsøvelsene",null,null,208,"poeng"]
["Øvelser:",null,null,null,null,"Koeff.","Karakter","Karakter","Snitt","Poeng"]
[11,"Feltsøk",null,null,null,10,null,null,{"$f":"IF(G42=\"\",\"\",IF(H42=\"\",\"\",(G42+H42)/2))","v":""},{"$f":"IF(I42=\"\",\"\",IF(I42=0,\"I.G.\",I42*F42))","v":""},null,null,null,null,"Poeng"]
[12,"Rapport",null,null,null,29,null,null,{"$f":"IF(G43=\"\",\"\",IF(H43=\"\",\"\",(G43+H43)/2))","v":""},{"$f":"IF(I43=\"\",\"\",IF(I43=0,\"I.G.\",I43*F43))","v":""},null,"Sum Lydighet",null,null,{"$f":"J22","v":0}]
["Sum spesialøvelser:",null,null,null,null,{"$f":"SUM(F42:F43)","v":39},null,null,null,{"$f":"IF(AND(J42=\"\",J43=\"\"),\"\",SUM(J42:J43))","v":""},null,"Sum Spesialøvelser",null,null,{"$f":"IF(Resultatskj!H4=\"Rundering\",J33,IF(Resultatskj!H4=\"Spor\",J28,IF(Resultatskj!H4=\"Rapport\",J44,\"\")))","v":""}]
[null,null,null,null,null,null,null,null,null,null,null,"Totalpoeng",null,null,{"$f":"SUM(O43:P44)","v":0}]
[null,null,null,null,null,null,null,null,null,null,null,"Ikke godkj.","Godkj.",null,"Cert","Plass"]
[null,null,null,null,null,null,null,null,null,null,null,{"$f":"IF(OR(O45<O35,O44<O36,O43<O37,O45=\"\"),\"X\",\"\")","v":"X"},{"$f":"IF(AND(O45>=O35,O44>=O36,O43>=O37,L47=\"\"),\"X\",\"\")","v":""},null,{"$f":"IF(AND(O45>=575,O44>=311.99,O43>207.99,L47=\"\"),\"X\",\"\")","v":""},{"$f":"Resultatskj!A8","v":"-"}]
["Underskrift dommere",null,null,null,null,null,null,null,null,null,null,"Original til NKK. Kopi til NBF, arrangørklubben og deltaker."]
[]
[{"$f":"IF(Resultatskj!$C$3=\"\",\"\",Resultatskj!$C$3)","v":""},null,null,null,null,null,null,null,null,null,null,{"$f":"Resultatskj!K26","v":"B.Strand/A.Bakken 15.07.2015/19.06.2018"}]
[{"$f":"IF(Resultatskj!$C$4=\"\",\"\",Resultatskj!$C$4)","v":""}]

{"sheet":"2","index":3,"n_rows":51,"n_cols":16,"rows_kept":51,"cut":false,"hidden":false,"merged":[[50,0,50,9],[10,0,10,4],[2,12,2,15],[14,10,14,15],[10,10,10,15],[11,10,11,15],[12,10,12,15],[13,10,13,15],[9,0,9,15],[14,1,14,4],[3,10,3,11],[11,1,11,4],[12,1,12,4],[13,1,13,4],[4,0,4,1],[4,2,4,9],[4,10,4,11],[27,0,27,4],[27,10,27,15],[19,1,19,4],[23,10,23,15],[24,10,24,15],[23,0,23,4],[26,1,26,4],[25,1,25,4],[22,0,22,15],[24,1,24,4],[25,10,25,15],[26,10,26,15],[4,12,4,15],[18,10,18,15],[15,1,15,4],[33,0,33,15],[34,0,34,1],[34,2,34,3],[40,0,40,4],[41,1,41,4],[34,4,34,9],[35,4,35,9],[36,4,36,9],[34,11,34,13],[41,14,41,15],[39,11,39,13],[38,11,38,13],[38,4,38,9],[37,4,37,9],[35,11,35,13],[36,11,36,13],[28,0,28,15],[29,0,29,4],[31,1,31,4],[32,0,32,4],[32,10,32,15],[30,1,30,4],[31,10,31,15],[30,10,30,15],[29,10,29,15],[18,1,18,4],[15,10,15,15],[16,1,16,4],[17,1,17,4],[16,10,16,15],[17,10,17,15],[20,1,20,4],[21,0,21,4],[21,10,21,15],[20,10,20,15],[19,10,19,15],[0,5,0,15],[1,0,1,1],[1,2,1,5],[1,10,1,12],[0,2,0,4],[2,0,2,1],[2,2,2,9],[2,10,2,11],[3,12,3,15],[3,0,3,1],[3,2,3,9],[37,11,37,13],[42,11,42,13],[41,11,41,13],[42,14,42,15],[42,1,42,4],[49,11,49,15],[47,0,47,9],[47,11,47,15],[49,0,49,9],[39,0,39,3],[39,4,39,9],[43,14,43,15],[43,11,43,13],[43,0,43,4],[44,11,44,13],[44,14,44,15],[44,0,46,9],[45,12,45,13],[46,12,46,13]]}
[null,null,null,null,null,{"$f":"'1'!F1:R1","v":"Kl. A - DOMMERPROTOKOLL"}]
[{"$f":"'1'!A2:B2","v":"Dato:"},null,{"$f":"IF(Resultatskj!L2=\"\",\"\",Resultatskj!L2)","v":""},null,null,null,null,null,null,{"$f":"'1'!J2","v":"Gruppe:"},{"$f":"IF(Resultatskj!H4=\"\",\"\",Resultatskj!H4)","v":"Spor"},null,null,null,"Katalog nr.",{"$f":"Resultatskj!B9","v":""}]
[{"$f":"'1'!A3:B3","v":"Arrangør:"},null,{"$f":"IF(Resultatskj!$C$2=\"\",\"\",Resultatskj!$C$2)","v":"Norsk Brukshundsports Forbund"},null,null,null,null,null,null,null,{"$f":"'1'!K3:L3","v":"Hundens navn:"}]
[{"$f":"'1'!A4:B4","v":"Fører:"},null,null,null,null,null,null,null,null,null,{"$f":"'1'!K4:L4","v":"Reg.nr.:"}]
[{"$f":"'1'!A5:B5","v":"Klubb:"},null,null,null,null,null,null,null,null,null,{"$f":"'1'!K5:L5","v":"Rase:"}]
[]
[null,"Klasse",null,"Liten",null,null,null,null,null,"Middels",null,null,"Stor"]
[]
[]
[{"$f":"'1'!A10","v":"Lydighet:"}]
[{"$f":"'1'!A11","v":"Øvelser:"},null,null,null,null,"Koeff.","Karakter","Karakter","Snitt","Poeng"]
[{"$f":"'1'!A12","v":1},{"$f":"'1'!B12","v":"Fri ved foten"},null,null,null,3,null,null,{"$f":"IF(G12=\"\",\"\",IF(H12=\"\",\"\",(G12+H12)/2))","v":""},{"$f":"IF(I12=\"\",\"\",IF(I12=0,\"I.G.\",I12*F12))","v":""}]
[{"$f":"'1'!A13","v":2},{"$f":"'1'!B13","v":"Innkalling m/stå og dekk"},null,null,null,3,null,null,{"$f":"IF(G13=\"\",\"\",IF(H13=\"\",\"\",(G13+H13)/2))","v":""},{"$f":"IF(I13=\"\",\"\",IF(I13=0,\"I.G.\",I13*F13))","v":""}]
[{"$f":"'1'!A14","v":3},{"$f":"'1'!B14","v":"Fremadsending"},null,null,null,3,null,null,"",""]
[{"$f":"'1'!A15","v":4},{"$f":"'1'!B15","v":"Kryp"},null,null,null,3,null,null,"",""]
[{"$f":"'1'!A16","v":5},{"$f":"'1'!B16","v":"Hals på kommando"},null,null,null,2,null,null,"",""]
[{"$f":"'1'!A17","v":6},{"$f":"'1'!B17","v":"Apportering metallapport"},null,null,null,3,null,null,"",""]
[{"$f":"'1'!A18","v":7},{"$f":"'1'!B18","v":"Apportering tung gjenstand"},null,null,null,3,null,null,"",""]
[{"$f":"'1'!A19","v":8},"Fritt hopp over hinder",null,null,null,2,null,null,"",""]
[{"$f":"'1'!A20","v":9},{"$f":"'1'!B20","v":"Stigeklatring"},null,null,null,2,null,null,"",""]
[{"$f":"'1'!A21","v":10},{"$f":"'1'!B21","v":"Fellesdekk"},null,null,null,2,null,null,"",""]
[{"$f":"'1'!A22","v":"Sum lydighet:"},null,null,null,null,{"$f":"SUM(F12:F21)","v":26},null,null,null,{"$f":"SUM(J12:J21)","v":0}]
[{"$f":"'1'!A23","v":"Sporgruppen:"}]
[{"$f":"'1'!A24","v":"Øvelser:"},null,null,null,null,"Koeff.","Karakter","Karakter","Snitt","Poeng"]
[{"$f":"'1'!A25","v":11},{"$f":"'1'!B25","v":"Feltsøk"},null,null,null,10,null,null,{"$f":"IF(G25=\"\",\"\",IF(H25=\"\",\"\",(G25+H25)/2))","v":""},{"$f":"IF(I25=\"\",\"\",IF(I25=0,\"I.G.\",I25*F25))","v":""}]
[{"$f":"'1'!A26","v":12},{"$f":"'1'!B26","v":"Sporoppsøk"},null,null,null,5,null,null,{"$f":"IF(G26=\"\",\"\",IF(H26=\"\",\"\",(G26+H26)/2))","v":""},{"$f":"IF(I26=\"\",\"\",IF(I26=0,\"I.G.\",I26*F26))","v":""}]
[{"$f":"'1'!A27","v":13},{"$f":"'1'!B27","v":"Spor"},null,null,null,24,null,null,"",""]
[{"$f":"'1'!A28","v":"Sum spesialøvelser:"},null,null,null,null,{"$f":"SUM(F25:F27)","v":39},null,null,null,{"$f":"IF(AND(J25=\"\",J26=\"\",J27=\"\"),\"\",SUM(J25:J27))","v":""}]
[{"$f":"'1'!A29","v":"Runderingsgruppen:"}]
[{"$f":"'1'!A30","v":"Øvelser:"},null,null,null,null,"Koeff.","Karakter","Karakter","Snitt","Poeng"]
[{"$f":"'1'!A31","v":11},{"$f":"'1'!B31","v":"Feltsøk"},null,null,null,10,null,null,{"$f":"IF(G31=\"\",\"\",IF(H31=\"\",\"\",(G31+H31)/2))","v":""},{"$f":"IF(I31=\"\",\"\",IF(I31=0,\"I.G.\",I31*F31))","v":""}]
[{"$f":"'1'!A32","v":12},{"$f":"'1'!B32","v":"Rundering"},null,null,null,{"$f":"'1'!F32","v":29},null,null,{"$f":"IF(G32=\"\",\"\",IF(H32=\"\",\"\",(G32+H32)/2))","v":""},{"$f":"IF(I32=\"\",\"\",IF(I32=0,\"I.G.\",I32*F32))","v":""}]
[{"$f":"'1'!A33","v":"Sum spesialøvelser:"},null,null,null,null,{"$f":"SUM(F31:F32)","v":39},null,null,null,{"$f":"IF(AND(J31=\"\",J32=\"\"),\"\",SUM(J31:J32))","v":""},null,"Godkjent",null,null,300,"poeng"]
[{"$f":"'1'!A34","v":"Rapportgruppen:"}]
[{"$f":"'1'!A35","v":"Start kl.:"},0,{"$f":"'1'!C35","v":"Ankomst kl.:"},0,{"$f":"'1'!E35:J35","v":"Anvendt tid:"},null,null,null,null,null,null,{"$f":"'1'!L35:N35","v":"Godkjent"},null,null,{"$f":"'1'!O35","v":325},{"$f":"'1'!P35","v":"poeng"}]
[{"$f":"'1'!A36","v":"B"},"00:00:00",{"$f":"'1'!C36","v":"A"},"00:00:00",{"$f":"SUM(B36,D36)","v":"00:00:00"},null,null,null,null,null,null,{"$f":"'1'!L36:N36","v":"- Derav i spesialøvelsene"},null,null,195,{"$f":"'1'!P36","v":"poeng"}]
[{"$f":"'1'!A37","v":"A"},"00:00:00",{"$f":"'1'!C37","v":"B"},"00:00:00",{"$f":"SUM(B37,D37)","v":"00:00:00"},null,null,null,null,null,null,"- Derav i lydighetsøvelsene",null,null,130,{"$f":"'1'!P37","v":"poeng"}]
[{"$f":"'1'!A38","v":"C"},"00:00:00",{"$f":"'1'!C38","v":"A"},"00:00:00",{"$f":"SUM(B38,D38)","v":"00:00:00"},null,null,null,null,null,null,{"$f":"'1'!L38:N38","v":"Cert/CACIT"},null,null,575,{"$f":"'1'!P38","v":"poeng"}]
[{"$f":"'1'!A39","v":"A"},"00:00:00",{"$f":"'1'!C39","v":"D"},"00:00:00",{"$f":"SUM(E35:J38)","v":"00:00:00"},null,null,null,null,null,null,{"$f":"'1'!L39:N39","v":"- Derav i spesialøvelsene"},null,null,312,{"$f":"'1'!P39","v":"poeng"}]
[{"$f":"'1'!A40","v":"Anvendt tid totalt:"},null,null,null,{"$f":"SUM(E36:J39)","v":"00:00:00"},null,null,null,null,null,null,{"$f":"'1'!L40:N40","v":"- Derav i lydighetsøvelsene"},null,null,208,{"$f":"'1'!P40","v":"poeng"}]
[{"$f":"'1'!A41","v":"Øvelser:"},null,null,null,null,{"$f":"'1'!F41","v":"Koeff."},{"$f":"'1'!G41","v":"Karakter"},{"$f":"'1'!H41","v":"Karakter"},"Snitt",{"$f":"'1'!J41","v":"Poeng"}]
[{"$f":"'1'!A42","v":11},{"$f":"'1'!B42","v":"Feltsøk"},null,null,null,10,null,null,{"$f":"IF(G42=\"\",\"\",IF(H42=\"\",\"\",(G42+H42)/2))","v":""},{"$f":"IF(I42=\"\",\"\",IF(I42=0,\"I.G.\",I42*F42))","v":""},null,null,null,null,{"$f":"'1'!O42:P42","v":"Poeng"}]
[{"$f":"'1'!A43","v":12},{"$f":"'1'!B43","v":"Rapport"},null,null,null,{"$f":"'1'!F43","v":29},null,null,{"$f":"IF(G43=\"\",\"\",IF(H43=\"\",\"\",(G43+H43)/2))","v":""},{"$f":"IF(I43=\"\",\"\",IF(I43=0,\"I.G.\",I43*F43))","v":""},null,{"$f":"'1'!L43:N43","v":"Sum Lydighet"},null,null,{"$f":"J22","v":0}]
[{"$f":"'1'!A44","v":"Sum spesialøvelser:"},null,null,null,null,{"$f":"SUM(F42:F43)","v":39},null,null,null,null,null,{"$f":"'1'!L44:N44","v":"Sum Spesialøvelser"},null,null,{"$f":"IF(Resultatskj!H4=\"Rundering\",J33,IF(Resultatskj!H4=\"Spor\",J28,IF(Resultatskj!H4=\"Rapport\",J44,\"\")))","v":""}]
[null,null,null,null,null,null,null,null,null,null,null,{"$f":"'1'!L45:N45","v":"Totalpoeng"},null,null,{"$f":"SUM(O43:P44)","v":0}]
[null,null,null,null,null,null,null,null,null,null,null,{"$f":"'1'!L46","v":"Ikke godkj."},{"$f":"'1'!M46","v":"Godkj."},null,{"$f":"'1'!O46","v":"Cert"},{"$f":"'1'!P46","v":"Plass"}]
[{"$f":"IF(Resultatskj!C3=\"\",\"\",Resultatskj!C3)","v":""},null,null,null,null,{"$f":"IF(Resultatskj!C4=\"\",\"\",Resultatskj!C4)","v":""},null,null,null,null,null,{"$f":"IF(OR(O45<O35,O44<O36,O43<O37,O45=\"\"),\"X\",\"\")","v":"X"},{"$f":"IF(AND(O45>=O35,O44>=O36,O43>=O37,L47=\"\"),\"X\",\"\")","v":""},null,{"$f":"IF(AND(O45>=575,O44>=311.99,O43>207.99,L47=\"\"),\"X\",\"\")","v":""},{"$f":"Resultatskj!A9","v":"-"}]
["Underskrift dommere",null,null,null,null,null,null,null,null,null,null,{"$f":"Resultatskj!K26","v":"B.Strand/A.Bakken 15.07.2015/19.06.2018"}]
[]
[{"$f":"IF(Resultatskj!$C$3=\"\",\"\",Resultatskj!$C$3)","v":""}]
[{"$f":"IF(Resultatskj!$C$4=\"\",\"\",Resultatskj!$C$4)","v":""}]

{"sheet":"3","index":4,"n_rows":51,"n_cols":16,"rows_kept":51,"cut":false,"hidden":false,"merged":[[43,11,43,13],[36,4,36,9],[38,11,38,13],[37,11,37,13],[37,4,37,9],[41,11,41,13],[39,11,39,13],[41,1,41,4],[27,10,27,15],[28,0,28,15],[29,0,29,4],[31,1,31,4],[29,10,29,15],[30,10,30,15],[30,1,30,4],[49,0,49,9],[50,0,50,9],[26,1,26,4],[27,0,27,4],[21,0,21,4],[34,4,34,9],[47,0,47,9],[35,4,35,9],[40,0,40,4],[42,1,42,4],[43,0,43,4],[34,2,34,3],[39,0,39,3],[39,4,39,9],[38,4,38,9],[24,1,24,4],[21,10,21,15],[32,10,32,15],[33,0,33,15],[0,5,0,15],[26,10,26,15],[2,2,2,9],[31,10,31,15],[2,12,2,15],[14,10,14,15],[9,0,9,15],[14,1,14,4],[2,0,2,1],[18,1,18,4],[19,1,19,4],[22,0,22,15],[32,0,32,4],[35,11,35,13],[36,11,36,13],[3,0,3,1],[3,2,3,9],[1,0,1,1],[1,2,1,5],[1,10,1,12],[3,10,3,11],[3,12,3,15],[2,10,2,11],[4,0,4,1],[4,2,4,9],[4,10,4,11],[20,1,20,4],[18,10,18,15],[19,10,19,15],[20,10,20,15],[10,0,10,4],[10,10,10,15],[11,1,11,4],[11,10,11,15],[17,1,17,4],[15,1,15,4],[16,10,16,15],[15,10,15,15],[17,10,17,15],[13,1,13,4],[13,10,13,15],[12,10,12,15],[16,1,16,4],[25,1,25,4],[25,10,25,15],[23,10,23,15],[24,10,24,15],[23,0,23,4],[34,11,34,13],[0,2,0,4],[44,0,46,9],[49,11,49,15],[47,11,47,15],[44,11,44,13],[44,14,44,15],[45,12,45,13],[46,12,46,13],[43,14,43,15],[41,14,41,15],[42,11,42,13],[42,14,42,15],[34,0,34,1],[4,12,4,15],[12,1,12,4]]}
[null,null,null,null,null,{"$f":"'1'!F1:R1","v":"Kl. A - DOMMERPROTOKOLL"}]
[{"$f":"'1'!A2:B2","v":"Dato:"},null,{"$f":"IF(Resultatskj!L2=\"\",\"\",Resultatskj!L2)","v":""},null,null,null,null,null,null,{"$f":"'1'!J2","v":"Gruppe:"},{"$f":"IF(Resultatskj!H4=\"\",\"\",Resultatskj!H4)","v":"Spor"},null,null,null,"Katalog nr.",{"$f":"Resultatskj!B10","v":""}]
[{"$f":"'1'!A3:B3","v":"Arrangør:"},null,{"$f":"IF(Resultatskj!$C$2=\"\",\"\",Resultatskj!$C$2)","v":"Norsk Brukshundsports Forbund"},null,null,null,null,null,null,null,{"$f":"'1'!K3:L3","v":"Hundens navn:"}]
[{"$f":"'1'!A4:B4","v":"Fører:"},null,null,null,null,null,null,null,null,null,{"$f":"'1'!K4:L4","v":"Reg.nr.:"}]
[{"$f":"'1'!A5:B5","v":"Klubb:"},null,null,null,null,null,null,null,null,null,{"$f":"'1'!K5:L5","v":"Rase:"}]
[]
[null,"Klasse",null,"Liten",null,null,null,null,null,"Middels",null,null,"Stor"]
[]
[]
[{"$f":"'1'!A10","v":"Lydighet:"}]
[{"$f":"'1'!A11","v":"Øvelser:"},null,null,null,null,"Koeff.","Karakter","Karakter","Snitt","Poeng"]
[{"$f":"'1'!A12","v":1},{"$f":"'1'!B12","v":"Fri ved foten"},null,null,null,3,null,null,{"$f":"IF(G12=\"\",\"\",IF(H12=\"\",\"\",(G12+H12)/2))","v":""},{"$f":"IF(I12=\"\",\"\",IF(I12=0,\"I.G.\",I12*F12))","v":""}]
[{"$f":"'1'!A13","v":2},{"$f":"'1'!B13","v":"Innkalling m/stå og dekk"},null,null,null,3,null,null,{"$f":"IF(G13=\"\",\"\",IF(H13=\"\",\"\",(G13+H13)/2))","v":""},{"$f":"IF(I13=\"\",\"\",IF(I13=0,\"I.G.\",I13*F13))","v":""}]
[{"$f":"'1'!A14","v":3},{"$f":"'1'!B14","v":"Fremadsending"},null,null,null,3,null,null,"",""]
[{"$f":"'1'!A15","v":4},{"$f":"'1'!B15","v":"Kryp"},null,null,null,3,null,null,"",""]
[{"$f":"'1'!A16","v":5},{"$f":"'1'!B16","v":"Hals på kommando"},null,null,null,2,null,null,"",""]
[{"$f":"'1'!A17","v":6},{"$f":"'1'!B17","v":"Apportering metallapport"},null,null,null,3,null,null,"",""]
[{"$f":"'1'!A18","v":7},{"$f":"'1'!B18","v":"Apportering tung gjenstand"},null,null,null,3,null,null,"",""]
[{"$f":"'1'!A19","v":8},"Fritt hopp over hinder",null,null,null,2,null,null,"",""]
[{"$f":"'1'!A20","v":9},{"$f":"'1'!B20","v":"Stigeklatring"},null,null,null,2,null,null,"",""]
[{"$f":"'1'!A21","v":10},{"$f":"'1'!B21","v":"Fellesdekk"},null,null,null,2,null,null,"",""]
[{"$f":"'1'!A22","v":"Sum lydighet:"},null,null,null,null,{"$f":"SUM(F12:F21)","v":26},null,null,null,{"$f":"SUM(J12:J21)","v":0}]
[{"$f":"'1'!A23","v":"Sporgruppen:"}]
[{"$f":"'1'!A24","v":"Øvelser:"},null,null,null,null,"Koeff.","Karakter","Karakter","Snitt","Poeng"]
[{"$f":"'1'!A25","v":11},{"$f":"'1'!B25","v":"Feltsøk"},null,null,null,10,null,null,{"$f":"IF(G25=\"\",\"\",IF(H25=\"\",\"\",(G25+H25)/2))","v":""},{"$f":"IF(I25=\"\",\"\",IF(I25=0,\"I.G.\",I25*F25))","v":""}]
[{"$f":"'1'!A26","v":12},{"$f":"'1'!B26","v":"Sporoppsøk"},null,null,null,5,null,null,{"$f":"IF(G26=\"\",\"\",IF(H26=\"\",\"\",(G26+H26)/2))","v":""},{"$f":"IF(I26=\"\",\"\",IF(I26=0,\"I.G.\",I26*F26))","v":""}]
[{"$f":"'1'!A27","v":13},{"$f":"'1'!B27","v":"Spor"},null,null,null,24,null,null,"",""]
[{"$f":"'1'!A28","v":"Sum spesialøvelser:"},null,null,null,null,{"$f":"SUM(F25:F27)","v":39},null,null,null,{"$f":"IF(AND(J25=\"\",J26=\"\",J27=\"\"),\"\",SUM(J25:J27))","v":""}]
[{"$f":"'1'!A29","v":"Runderingsgruppen:"}]
[{"$f":"'1'!A30","v":"Øvelser:"},null,null,null,null,"Koeff.","Karakter","Karakter","Snitt","Poeng"]
[{"$f":"'1'!A31","v":11},{"$f":"'1'!B31","v":"Feltsøk"},null,null,null,10,null,null,{"$f":"IF(G31=\"\",\"\",IF(H31=\"\",\"\",(G31+H31)/2))","v":""},{"$f":"IF(I31=\"\",\"\",IF(I31=0,\"I.G.\",I31*F31))","v":""}]
[{"$f":"'1'!A32","v":12},{"$f":"'1'!B32","v":"Rundering"},null,null,null,{"$f":"'1'!F32","v":29},null,null,{"$f":"IF(G32=\"\",\"\",IF(H32=\"\",\"\",(G32+H32)/2))","v":""},{"$f":"IF(I32=\"\",\"\",IF(I32=0,\"I.G.\",I32*F32))","v":""}]
[{"$f":"'1'!A33","v":"Sum spesialøvelser:"},null,null,null,null,{"$f":"SUM(F31:F32)","v":39},null,null,null,{"$f":"IF(AND(J31=\"\",J32=\"\"),\"\",SUM(J31:J32))","v":""},null,"Godkjent",null,null,300,"poeng"]
[{"$f":"'1'!A34","v":"Rapportgruppen:"}]
[{"$f":"'1'!A35","v":"Start kl.:"},0,{"$f":"'1'!C35","v":"Ankomst kl.:"},0,{"$f":"'1'!E35:J35","v":"Anvendt tid:"},null,null,null,null,null,null,{"$f":"'1'!L35:N35","v":"Godkjent"},null,null,{"$f":"'1'!O35","v":325},{"$f":"'1'!P35","v":"poeng"}]
[{"$f":"'1'!A36","v":"B"},"00:00:00",{"$f":"'1'!C36","v":"A"},"00:00:00",{"$f":"SUM(B36,D36)","v":"00:00:00"},null,null,null,null,null,null,{"$f":"'1'!L36:N36","v":"- Derav i spesialøvelsene"},null,null,195,{"$f":"'1'!P36","v":"poeng"}]
[{"$f":"'1'!A37","v":"A"},"00:00:00",{"$f":"'1'!C37","v":"B"},"00:00:00",{"$f":"SUM(B37,D37)","v":"00:00:00"},null,null,null,null,null,null,"- Derav i lydighetsøvelsene",null,null,130,{"$f":"'1'!P37","v":"poeng"}]
[{"$f":"'1'!A38","v":"C"},"00:00:00",{"$f":"'1'!C38","v":"A"},"00:00:00",{"$f":"SUM(B38,D38)","v":"00:00:00"},null,null,null,null,null,null,{"$f":"'1'!L38:N38","v":"Cert/CACIT"},null,null,575,{"$f":"'1'!P38","v":"poeng"}]
[{"$f":"'1'!A39","v":"A"},"00:00:00",{"$f":"'1'!C39","v":"D"},"00:00:00",{"$f":"SUM(E35:J38)","v":"00:00:00"},null,null,null,null,null,null,{"$f":"'1'!L39:N39","v":"- Derav i spesialøvelsene"},null,null,312,{"$f":"'1'!P39","v":"poeng"}]
[{"$f":"'1'!A40","v":"Anvendt tid totalt:"},null,null,null,{"$f":"SUM(E36:J39)","v":"00:00:00"},null,null,null,null,null,null,{"$f":"'1'!L40:N40","v":"- Derav i lydighetsøvelsene"},null,null,208,{"$f":"'1'!P40","v":"poeng"}]
[{"$f":"'1'!A41","v":"Øvelser:"},null,null,null,null,{"$f":"'1'!F41","v":"Koeff."},{"$f":"'1'!G41","v":"Karakter"},{"$f":"'1'!H41","v":"Karakter"},"Snitt",{"$f":"'1'!J41","v":"Poeng"}]
[{"$f":"'1'!A42","v":11},{"$f":"'1'!B42","v":"Feltsøk"},null,null,null,10,null,null,{"$f":"IF(G42=\"\",\"\",IF(H42=\"\",\"\",(G42+H42)/2))","v":""},{"$f":"IF(I42=\"\",\"\",IF(I42=0,\"I.G.\",I42*F42))","v":""},null,null,null,null,{"$f":"'1'!O42:P42","v":"Poeng"}]
[{"$f":"'1'!A43","v":12},{"$f":"'1'!B43","v":"Rapport"},null,null,null,{"$f":"'1'!F43","v":29},null,null,{"$f":"IF(G43=\"\",\"\",IF(H43=\"\",\"\",(G43+H43)/2))","v":""},{"$f":"IF(I43=\"\",\"\",IF(I43=0,\"I.G.\",I43*F43))","v":""},null,{"$f":"'1'!L43:N43","v":"Sum Lydighet"},null,null,{"$f":"J22","v":0}]
[{"$f":"'1'!A44","v":"Sum spesialøvelser:"},null,null,null,null,{"$f":"SUM(F42:F43)","v":39},null,null,null,null,null,{"$f":"'1'!L44:N44","v":"Sum Spesialøvelser"},null,null,{"$f":"IF(Resultatskj!H4=\"Rundering\",J33,IF(Resultatskj!H4=\"Spor\",J28,IF(Resultatskj!H4=\"Rapport\",J44,\"\")))","v":""}]
[null,null,null,null,null,null,null,null,null,null,null,{"$f":"'1'!L45:N45","v":"Totalpoeng"},null,null,{"$f":"SUM(O43:P44)","v":0}]
[null,null,null,null,null,null,null,null,null,null,null,{"$f":"'1'!L46","v":"Ikke godkj."},{"$f":"'1'!M46","v":"Godkj."},null,{"$f":"'1'!O46","v":"Cert"},{"$f":"'1'!P46","v":"Plass"}]
[{"$f":"IF(Resultatskj!C3=\"\",\"\",Resultatskj!C3)","v":""},null,null,null,null,{"$f":"IF(Resultatskj!C4=\"\",\"\",Resultatskj!C4)","v":""},null,null,null,null,null,{"$f":"IF(OR(O45<O35,O44<O36,O43<O37,O45=\"\"),\"X\",\"\")","v":"X"},{"$f":"IF(AND(O45>=O35,O44>=O36,O43>=O37,L47=\"\"),\"X\",\"\")","v":""},null,{"$f":"IF(AND(O45>=575,O44>=311.99,O43>207.99,L47=\"\"),\"X\",\"\")","v":""},{"$f":"Resultatskj!A10","v":"-"}]
["Underskrift dommere",null,null,null,null,null,null,null,null,null,null,{"$f":"Resultatskj!K26","v":"B.Strand/A.Bakken 15.07.2015/19.06.2018"}]
[]
[{"$f":"IF(Resultatskj!$C$3=\"\",\"\",Resultatskj!$C$3)","v":""}]
[{"$f":"IF(Resultatskj!$C$4=\"\",\"\",Resultatskj!$C$4)","v":""}]

{"sheet":"4","index":5,"n_rows":51,"n_cols":16,"rows_kept":51,"cut":false,"hidden":false,"merged":[[50,0,50,9],[33,0,33,15],[34,0,34,1],[34,2,34,3],[41,14,41,15],[40,0,40,4],[41,11,41,13],[34,11,34,13],[35,11,35,13],[37,11,37,13],[38,11,38,13],[38,4,38,9],[37,4,37,9],[36,4,36,9],[35,4,35,9],[36,11,36,13],[9,0,9,15],[14,1,14,4],[24,1,24,4],[25,1,25,4],[25,10,25,15],[19,1,19,4],[14,10,14,15],[10,10,10,15],[11,10,11,15],[12,10,12,15],[10,0,10,4],[24,10,24,15],[18,10,18,15],[18,1,18,4],[15,10,15,15],[15,1,15,4],[0,5,0,15],[1,10,1,12],[1,2,1,5],[1,0,1,1],[0,2,0,4],[2,10,2,11],[2,12,2,15],[3,0,3,1],[34,4,34,9],[30,1,30,4],[31,1,31,4],[32,0,32,4],[3,2,3,9],[3,10,3,11],[3,12,3,15],[2,0,2,1],[2,2,2,9],[4,0,4,1],[4,2,4,9],[4,10,4,11],[4,12,4,15],[22,0,22,15],[23,0,23,4],[13,10,13,15],[11,1,11,4],[12,1,12,4],[13,1,13,4],[21,0,21,4],[20,1,20,4],[19,10,19,15],[16,10,16,15],[17,10,17,15],[21,10,21,15],[16,1,16,4],[17,1,17,4],[20,10,20,15],[23,10,23,15],[32,10,32,15],[26,1,26,4],[27,0,27,4],[27,10,27,15],[28,0,28,15],[31,10,31,15],[30,10,30,15],[29,10,29,15],[29,0,29,4],[26,10,26,15],[39,11,39,13],[42,1,42,4],[43,0,43,4],[44,11,44,13],[44,0,46,9],[41,1,41,4],[39,0,39,3],[39,4,39,9],[44,14,44,15],[43,14,43,15],[43,11,43,13],[42,14,42,15],[42,11,42,13],[49,11,49,15],[47,11,47,15],[45,12,45,13],[46,12,46,13],[47,0,47,9],[49,0,49,9]]}
[null,null,null,null,null,{"$f":"'1'!F1:R1","v":"Kl. A - DOMMERPROTOKOLL"}]
[{"$f":"'1'!A2:B2","v":"Dato:"},null,{"$f":"IF(Resultatskj!L2=\"\",\"\",Resultatskj!L2)","v":""},null,null,null,null,null,null,{"$f":"'1'!J2","v":"Gruppe:"},{"$f":"IF(Resultatskj!H4=\"\",\"\",Resultatskj!H4)","v":"Spor"},null,null,null,"Katalog nr.",{"$f":"Resultatskj!B11","v":""}]
[{"$f":"'1'!A3:B3","v":"Arrangør:"},null,{"$f":"IF(Resultatskj!$C$2=\"\",\"\",Resultatskj!$C$2)","v":"Norsk Brukshundsports Forbund"},null,null,null,null,null,null,null,{"$f":"'1'!K3:L3","v":"Hundens navn:"}]
[{"$f":"'1'!A4:B4","v":"Fører:"},null,null,null,null,null,null,null,null,null,{"$f":"'1'!K4:L4","v":"Reg.nr.:"}]
[{"$f":"'1'!A5:B5","v":"Klubb:"},null,null,null,null,null,null,null,null,null,{"$f":"'1'!K5:L5","v":"Rase:"}]
[]
[null,"Klasse",null,"Liten",null,null,null,null,null,"Middels",null,null,"Stor"]
[]
[]
[{"$f":"'1'!A10","v":"Lydighet:"}]
[{"$f":"'1'!A11","v":"Øvelser:"},null,null,null,null,"Koeff.","Karakter","Karakter","Snitt","Poeng"]
[{"$f":"'1'!A12","v":1},{"$f":"'1'!B12","v":"Fri ved foten"},null,null,null,3,null,null,{"$f":"IF(G12=\"\",\"\",IF(H12=\"\",\"\",(G12+H12)/2))","v":""},{"$f":"IF(I12=\"\",\"\",IF(I12=0,\"I.G.\",I12*F12))","v":""}]
[{"$f":"'1'!A13","v":2},{"$f":"'1'!B13","v":"Innkalling m/stå og dekk"},null,null,null,3,null,null,{"$f":"IF(G13=\"\",\"\",IF(H13=\"\",\"\",(G13+H13)/2))","v":""},{"$f":"IF(I13=\"\",\"\",IF(I13=0,\"I.G.\",I13*F13))","v":""}]
[{"$f":"'1'!A14","v":3},{"$f":"'1'!B14","v":"Fremadsending"},null,null,null,3,null,null,"",""]
[{"$f":"'1'!A15","v":4},{"$f":"'1'!B15","v":"Kryp"},null,null,null,3,null,null,"",""]
[{"$f":"'1'!A16","v":5},{"$f":"'1'!B16","v":"Hals på kommando"},null,null,null,2,null,null,"",""]
[{"$f":"'1'!A17","v":6},{"$f":"'1'!B17","v":"Apportering metallapport"},null,null,null,3,null,null,"",""]
[{"$f":"'1'!A18","v":7},{"$f":"'1'!B18","v":"Apportering tung gjenstand"},null,null,null,3,null,null,"",""]
[{"$f":"'1'!A19","v":8},"Fritt hopp over hinder",null,null,null,2,null,null,"",""]
[{"$f":"'1'!A20","v":9},{"$f":"'1'!B20","v":"Stigeklatring"},null,null,null,2,null,null,"",""]
[{"$f":"'1'!A21","v":10},{"$f":"'1'!B21","v":"Fellesdekk"},null,null,null,2,null,null,"",""]
[{"$f":"'1'!A22","v":"Sum lydighet:"},null,null,null,null,{"$f":"SUM(F12:F21)","v":26},null,null,null,{"$f":"SUM(J12:J21)","v":0}]
[{"$f":"'1'!A23","v":"Sporgruppen:"}]
[{"$f":"'1'!A24","v":"Øvelser:"},null,null,null,null,"Koeff.","Karakter","Karakter","Snitt","Poeng"]
[{"$f":"'1'!A25","v":11},{"$f":"'1'!B25","v":"Feltsøk"},null,null,null,10,null,null,{"$f":"IF(G25=\"\",\"\",IF(H25=\"\",\"\",(G25+H25)/2))","v":""},{"$f":"IF(I25=\"\",\"\",IF(I25=0,\"I.G.\",I25*F25))","v":""}]
[{"$f":"'1'!A26","v":12},{"$f":"'1'!B26","v":"Sporoppsøk"},null,null,null,5,null,null,{"$f":"IF(G26=\"\",\"\",IF(H26=\"\",\"\",(G26+H26)/2))","v":""},{"$f":"IF(I26=\"\",\"\",IF(I26=0,\"I.G.\",I26*F26))","v":""}]
[{"$f":"'1'!A27","v":13},{"$f":"'1'!B27","v":"Spor"},null,null,null,24,null,null,"",""]
[{"$f":"'1'!A28","v":"Sum spesialøvelser:"},null,null,null,null,{"$f":"SUM(F25:F27)","v":39},null,null,null,{"$f":"IF(AND(J25=\"\",J26=\"\",J27=\"\"),\"\",SUM(J25:J27))","v":""}]
[{"$f":"'1'!A29","v":"Runderingsgruppen:"}]
[{"$f":"'1'!A30","v":"Øvelser:"},null,null,null,null,"Koeff.","Karakter","Karakter","Snitt","Poeng"]
[{"$f":"'1'!A31","v":11},{"$f":"'1'!B31","v":"Feltsøk"},null,null,null,10,null,null,{"$f":"IF(G31=\"\",\"\",IF(H31=\"\",\"\",(G31+H31)/2))","v":""},{"$f":"IF(I31=\"\",\"\",IF(I31=0,\"I.G.\",I31*F31))","v":""}]
[{"$f":"'1'!A32","v":12},{"$f":"'1'!B32","v":"Rundering"},null,null,null,{"$f":"'1'!F32","v":29},null,null,{"$f":"IF(G32=\"\",\"\",IF(H32=\"\",\"\",(G32+H32)/2))","v":""},{"$f":"IF(I32=\"\",\"\",IF(I32=0,\"I.G.\",I32*F32))","v":""}]
[{"$f":"'1'!A33","v":"Sum spesialøvelser:"},null,null,null,null,{"$f":"SUM(F31:F32)","v":39},null,null,null,{"$f":"IF(AND(J31=\"\",J32=\"\"),\"\",SUM(J31:J32))","v":""},null,"Godkjent",null,null,300,"poeng"]
[{"$f":"'1'!A34","v":"Rapportgruppen:"}]
[{"$f":"'1'!A35","v":"Start kl.:"},0,{"$f":"'1'!C35","v":"Ankomst kl.:"},0,{"$f":"'1'!E35:J35","v":"Anvendt tid:"},null,null,null,null,null,null,{"$f":"'1'!L35:N35","v":"Godkjent"},null,null,{"$f":"'1'!O35","v":325},{"$f":"'1'!P35","v":"poeng"}]
[{"$f":"'1'!A36","v":"B"},"00:00:00",{"$f":"'1'!C36","v":"A"},"00:00:00",{"$f":"SUM(B36,D36)","v":"00:00:00"},null,null,null,null,null,null,{"$f":"'1'!L36:N36","v":"- Derav i spesialøvelsene"},null,null,195,{"$f":"'1'!P36","v":"poeng"}]
[{"$f":"'1'!A37","v":"A"},"00:00:00",{"$f":"'1'!C37","v":"B"},"00:00:00",{"$f":"SUM(B37,D37)","v":"00:00:00"},null,null,null,null,null,null,"- Derav i lydighetsøvelsene",null,null,130,{"$f":"'1'!P37","v":"poeng"}]
[{"$f":"'1'!A38","v":"C"},"00:00:00",{"$f":"'1'!C38","v":"A"},"00:00:00",{"$f":"SUM(B38,D38)","v":"00:00:00"},null,null,null,null,null,null,{"$f":"'1'!L38:N38","v":"Cert/CACIT"},null,null,575,{"$f":"'1'!P38","v":"poeng"}]
[{"$f":"'1'!A39","v":"A"},"00:00:00",{"$f":"'1'!C39","v":"D"},"00:00:00",{"$f":"SUM(E35:J38)","v":"00:00:00"},null,null,null,null,null,null,{"$f":"'1'!L39:N39","v":"- Derav i spesialøvelsene"},null,null,312,{"$f":"'1'!P39","v":"poeng"}]
[{"$f":"'1'!A40","v":"Anvendt tid totalt:"},null,null,null,{"$f":"SUM(E36:J39)","v":"00:00:00"},null,null,null,null,null,null,{"$f":"'1'!L40:N40","v":"- Derav i lydighetsøvelsene"},null,null,208,{"$f":"'1'!P40","v":"poeng"}]
[{"$f":"'1'!A41","v":"Øvelser:"},null,null,null,null,{"$f":"'1'!F41","v":"Koeff."},{"$f":"'1'!G41","v":"Karakter"},{"$f":"'1'!H41","v":"Karakter"},"Snitt",{"$f":"'1'!J41","v":"Poeng"}]
[{"$f":"'1'!A42","v":11},{"$f":"'1'!B42","v":"Feltsøk"},null,null,null,10,null,null,{"$f":"IF(G42=\"\",\"\",IF(H42=\"\",\"\",(G42+H42)/2))","v":""},{"$f":"IF(I42=\"\",\"\",IF(I42=0,\"I.G.\",I42*F42))","v":""},null,null,null,null,{"$f":"'1'!O42:P42","v":"Poeng"}]
[{"$f":"'1'!A43","v":12},{"$f":"'1'!B43","v":"Rapport"},null,null,null,{"$f":"'1'!F43","v":29},null,null,{"$f":"IF(G43=\"\",\"\",IF(H43=\"\",\"\",(G43+H43)/2))","v":""},{"$f":"IF(I43=\"\",\"\",IF(I43=0,\"I.G.\",I43*F43))","v":""},null,{"$f":"'1'!L43:N43","v":"Sum Lydighet"},null,null,{"$f":"J22","v":0}]
[{"$f":"'1'!A44","v":"Sum spesialøvelser:"},null,null,null,null,{"$f":"SUM(F42:F43)","v":39},null,null,null,null,null,{"$f":"'1'!L44:N44","v":"Sum Spesialøvelser"},null,null,{"$f":"IF(Resultatskj!H4=\"Rundering\",J33,IF(Resultatskj!H4=\"Spor\",J28,IF(Resultatskj!H4=\"Rapport\",J44,\"\")))","v":""}]
[null,null,null,null,null,null,null,null,null,null,null,{"$f":"'1'!L45:N45","v":"Totalpoeng"},null,null,{"$f":"SUM(O43:P44)","v":0}]
[null,null,null,null,null,null,null,null,null,null,null,{"$f":"'1'!L46","v":"Ikke godkj."},{"$f":"'1'!M46","v":"Godkj."},null,{"$f":"'1'!O46","v":"Cert"},{"$f":"'1'!P46","v":"Plass"}]
[{"$f":"IF(Resultatskj!C3=\"\",\"\",Resultatskj!C3)","v":""},null,null,null,null,{"$f":"IF(Resultatskj!C4=\"\",\"\",Resultatskj!C4)","v":""},null,null,null,null,null,{"$f":"IF(OR(O45<O35,O44<O36,O43<O37,O45=\"\"),\"X\",\"\")","v":"X"},{"$f":"IF(AND(O45>=O35,O44>=O36,O43>=O37,L47=\"\"),\"X\",\"\")","v":""},null,{"$f":"IF(AND(O45>=575,O44>=311.99,O43>207.99,L47=\"\"),\"X\",\"\")","v":""},{"$f":"Resultatskj!A11","v":"-"}]
["Underskrift dommere",null,null,null,null,null,null,null,null,null,null,{"$f":"Resultatskj!K26","v":"B.Strand/A.Bakken 15.07.2015/19.06.2018"}]
[]
[{"$f":"IF(Resultatskj!$C$3=\"\",\"\",Resultatskj!$C$3)","v":""}]
[{"$f":"IF(Resultatskj!$C$4=\"\",\"\",Resultatskj!$C$4)","v":""}]

{"sheet":"5","index":6,"n_rows":51,"n_cols":16,"rows_kept":51,"cut":false,"hidden":false,"merged":[[49,0,49,9],[50,0,50,9],[25,10,25,15],[21,0,21,4],[21,10,21,15],[22,0,22,15],[24,1,24,4],[23,0,23,4],[23,10,23,15],[24,10,24,15],[37,11,37,13],[36,4,36,9],[29,0,29,4],[31,1,31,4],[34,4,34,9],[32,0,32,4],[2,10,2,11],[9,0,9,15],[3,0,3,1],[3,2,3,9],[14,10,14,15],[14,1,14,4],[2,12,2,15],[2,0,2,1],[31,10,31,15],[30,1,30,4],[30,10,30,15],[27,0,27,4],[27,10,27,15],[28,0,28,15],[29,10,29,15],[20,10,20,15],[15,1,15,4],[16,10,16,15],[18,1,18,4],[20,1,20,4],[17,1,17,4],[19,10,19,15],[19,1,19,4],[15,10,15,15],[17,10,17,15],[16,1,16,4],[18,10,18,15],[1,10,1,12],[11,10,11,15],[13,1,13,4],[13,10,13,15],[12,1,12,4],[12,10,12,15],[11,1,11,4],[4,0,4,1],[4,2,4,9],[1,0,1,1],[1,2,1,5],[3,10,3,11],[3,12,3,15],[2,2,2,9],[4,10,4,11],[10,10,10,15],[42,14,42,15],[35,11,35,13],[42,11,42,13],[34,11,34,13],[41,11,41,13],[39,11,39,13],[38,11,38,13],[41,14,41,15],[33,0,33,15],[34,0,34,1],[34,2,34,3],[39,0,39,3],[39,4,39,9],[36,11,36,13],[35,4,35,9],[38,4,38,9],[37,4,37,9],[47,0,47,9],[0,2,0,4],[44,0,46,9],[40,0,40,4],[42,1,42,4],[41,1,41,4],[43,0,43,4],[25,1,25,4],[26,1,26,4],[0,5,0,15],[26,10,26,15],[4,12,4,15],[10,0,10,4],[43,11,43,13],[43,14,43,15],[32,10,32,15],[49,11,49,15],[47,11,47,15],[44,14,44,15],[45,12,45,13],[46,12,46,13],[44,11,44,13]]}
[null,null,null,null,null,{"$f":"'1'!F1:R1","v":"Kl. A - DOMMERPROTOKOLL"}]
[{"$f":"'1'!A2:B2","v":"Dato:"},null,{"$f":"IF(Resultatskj!L2=\"\",\"\",Resultatskj!L2)","v":""},null,null,null,null,null,null,{"$f":"'1'!J2","v":"Gruppe:"},{"$f":"IF(Resultatskj!H4=\"\",\"\",Resultatskj!H4)","v":"Spor"},null,null,null,"Katalog nr.",{"$f":"Resultatskj!B12","v":""}]
[{"$f":"'1'!A3:B3","v":"Arrangør:"},null,{"$f":"IF(Resultatskj!$C$2=\"\",\"\",Resultatskj!$C$2)","v":"Norsk Brukshundsports Forbund"},null,null,null,null,null,null,null,{"$f":"'1'!K3:L3","v":"Hundens navn:"}]
[{"$f":"'1'!A4:B4","v":"Fører:"},null,null,null,null,null,null,null,null,null,{"$f":"'1'!K4:L4","v":"Reg.nr.:"}]
[{"$f":"'1'!A5:B5","v":"Klubb:"},null,null,null,null,null,null,null,null,null,{"$f":"'1'!K5:L5","v":"Rase:"}]
[]
[null,"Klasse",null,"Liten",null,null,null,null,null,"Middels",null,null,"Stor"]
[]
[]
[{"$f":"'1'!A10","v":"Lydighet:"}]
[{"$f":"'1'!A11","v":"Øvelser:"},null,null,null,null,"Koeff.","Karakter","Karakter","Snitt","Poeng"]
[{"$f":"'1'!A12","v":1},{"$f":"'1'!B12","v":"Fri ved foten"},null,null,null,3,null,null,{"$f":"IF(G12=\"\",\"\",IF(H12=\"\",\"\",(G12+H12)/2))","v":""},{"$f":"IF(I12=\"\",\"\",IF(I12=0,\"I.G.\",I12*F12))","v":""}]
[{"$f":"'1'!A13","v":2},{"$f":"'1'!B13","v":"Innkalling m/stå og dekk"},null,null,null,3,null,null,{"$f":"IF(G13=\"\",\"\",IF(H13=\"\",\"\",(G13+H13)/2))","v":""},{"$f":"IF(I13=\"\",\"\",IF(I13=0,\"I.G.\",I13*F13))","v":""}]
[{"$f":"'1'!A14","v":3},{"$f":"'1'!B14","v":"Fremadsending"},null,null,null,3,null,null,"",""]
[{"$f":"'1'!A15","v":4},{"$f":"'1'!B15","v":"Kryp"},null,null,null,3,null,null,"",""]
[{"$f":"'1'!A16","v":5},{"$f":"'1'!B16","v":"Hals på kommando"},null,null,null,2,null,null,"",""]
[{"$f":"'1'!A17","v":6},{"$f":"'1'!B17","v":"Apportering metallapport"},null,null,null,3,null,null,"",""]
[{"$f":"'1'!A18","v":7},{"$f":"'1'!B18","v":"Apportering tung gjenstand"},null,null,null,3,null,null,"",""]
[{"$f":"'1'!A19","v":8},"Fritt hopp over hinder",null,null,null,2,null,null,"",""]
[{"$f":"'1'!A20","v":9},{"$f":"'1'!B20","v":"Stigeklatring"},null,null,null,2,null,null,"",""]
[{"$f":"'1'!A21","v":10},{"$f":"'1'!B21","v":"Fellesdekk"},null,null,null,2,null,null,"",""]
[{"$f":"'1'!A22","v":"Sum lydighet:"},null,null,null,null,{"$f":"SUM(F12:F21)","v":26},null,null,null,{"$f":"SUM(J12:J21)","v":0}]
[{"$f":"'1'!A23","v":"Sporgruppen:"}]
[{"$f":"'1'!A24","v":"Øvelser:"},null,null,null,null,"Koeff.","Karakter","Karakter","Snitt","Poeng"]
[{"$f":"'1'!A25","v":11},{"$f":"'1'!B25","v":"Feltsøk"},null,null,null,10,null,null,{"$f":"IF(G25=\"\",\"\",IF(H25=\"\",\"\",(G25+H25)/2))","v":""},{"$f":"IF(I25=\"\",\"\",IF(I25=0,\"I.G.\",I25*F25))","v":""}]
[{"$f":"'1'!A26","v":12},{"$f":"'1'!B26","v":"Sporoppsøk"},null,null,null,5,null,null,{"$f":"IF(G26=\"\",\"\",IF(H26=\"\",\"\",(G26+H26)/2))","v":""},{"$f":"IF(I26=\"\",\"\",IF(I26=0,\"I.G.\",I26*F26))","v":""}]
[{"$f":"'1'!A27","v":13},{"$f":"'1'!B27","v":"Spor"},null,null,null,24,null,null,"",""]
[{"$f":"'1'!A28","v":"Sum spesialøvelser:"},null,null,null,null,{"$f":"SUM(F25:F27)","v":39},null,null,null,{"$f":"IF(AND(J25=\"\",J26=\"\",J27=\"\"),\"\",SUM(J25:J27))","v":""}]
[{"$f":"'1'!A29","v":"Runderingsgruppen:"}]
[{"$f":"'1'!A30","v":"Øvelser:"},null,null,null,null,"Koeff.","Karakter","Karakter","Snitt","Poeng"]
[{"$f":"'1'!A31","v":11},{"$f":"'1'!B31","v":"Feltsøk"},null,null,null,10,null,null,{"$f":"IF(G31=\"\",\"\",IF(H31=\"\",\"\",(G31+H31)/2))","v":""},{"$f":"IF(I31=\"\",\"\",IF(I31=0,\"I.G.\",I31*F31))","v":""}]
[{"$f":"'1'!A32","v":12},{"$f":"'1'!B32","v":"Rundering"},null,null,null,{"$f":"'1'!F32","v":29},null,null,{"$f":"IF(G32=\"\",\"\",IF(H32=\"\",\"\",(G32+H32)/2))","v":""},{"$f":"IF(I32=\"\",\"\",IF(I32=0,\"I.G.\",I32*F32))","v":""}]
[{"$f":"'1'!A33","v":"Sum spesialøvelser:"},null,null,null,null,{"$f":"SUM(F31:F32)","v":39},null,null,null,{"$f":"IF(AND(J31=\"\",J32=\"\"),\"\",SUM(J31:J32))","v":""},null,"Godkjent",null,null,300,"poeng"]
[{"$f":"'1'!A34","v":"Rapportgruppen:"}]
[{"$f":"'1'!A35","v":"Start kl.:"},0,{"$f":"'1'!C35","v":"Ankomst kl.:"},0,{"$f":"'1'!E35:J35","v":"Anvendt tid:"},null,null,null,null,null,null,{"$f":"'1'!L35:N35","v":"Godkjent"},null,null,{"$f":"'1'!O35","v":325},{"$f":"'1'!P35","v":"poeng"}]
[{"$f":"'1'!A36","v":"B"},"00:00:00",{"$f":"'1'!C36","v":"A"},"00:00:00",{"$f":"SUM(B36,D36)","v":"00:00:00"},null,null,null,null,null,null,{"$f":"'1'!L36:N36","v":"- Derav i spesialøvelsene"},null,null,195,{"$f":"'1'!P36","v":"poeng"}]
[{"$f":"'1'!A37","v":"A"},"00:00:00",{"$f":"'1'!C37","v":"B"},"00:00:00",{"$f":"SUM(B37,D37)","v":"00:00:00"},null,null,null,null,null,null,"- Derav i lydighetsøvelsene",null,null,130,{"$f":"'1'!P37","v":"poeng"}]
[{"$f":"'1'!A38","v":"C"},"00:00:00",{"$f":"'1'!C38","v":"A"},"00:00:00",{"$f":"SUM(B38,D38)","v":"00:00:00"},null,null,null,null,null,null,{"$f":"'1'!L38:N38","v":"Cert/CACIT"},null,null,575,{"$f":"'1'!P38","v":"poeng"}]
[{"$f":"'1'!A39","v":"A"},"00:00:00",{"$f":"'1'!C39","v":"D"},"00:00:00",{"$f":"SUM(E35:J38)","v":"00:00:00"},null,null,null,null,null,null,{"$f":"'1'!L39:N39","v":"- Derav i spesialøvelsene"},null,null,312,{"$f":"'1'!P39","v":"poeng"}]
[{"$f":"'1'!A40","v":"Anvendt tid totalt:"},null,null,null,{"$f":"SUM(E36:J39)","v":"00:00:00"},null,null,null,null,null,null,{"$f":"'1'!L40:N40","v":"- Derav i lydighetsøvelsene"},null,null,208,{"$f":"'1'!P40","v":"poeng"}]
[{"$f":"'1'!A41","v":"Øvelser:"},null,null,null,null,{"$f":"'1'!F41","v":"Koeff."},{"$f":"'1'!G41","v":"Karakter"},{"$f":"'1'!H41","v":"Karakter"},"Snitt",{"$f":"'1'!J41","v":"Poeng"}]
[{"$f":"'1'!A42","v":11},{"$f":"'1'!B42","v":"Feltsøk"},null,null,null,10,null,null,{"$f":"IF(G42=\"\",\"\",IF(H42=\"\",\"\",(G42+H42)/2))","v":""},{"$f":"IF(I42=\"\",\"\",IF(I42=0,\"I.G.\",I42*F42))","v":""},null,null,null,null,{"$f":"'1'!O42:P42","v":"Poeng"}]
[{"$f":"'1'!A43","v":12},{"$f":"'1'!B43","v":"Rapport"},null,null,null,{"$f":"'1'!F43","v":29},null,null,{"$f":"IF(G43=\"\",\"\",IF(H43=\"\",\"\",(G43+H43)/2))","v":""},{"$f":"IF(I43=\"\",\"\",IF(I43=0,\"I.G.\",I43*F43))","v":""},null,{"$f":"'1'!L43:N43","v":"Sum Lydighet"},null,null,{"$f":"J22","v":0}]
[{"$f":"'1'!A44","v":"Sum spesialøvelser:"},null,null,null,null,{"$f":"SUM(F42:F43)","v":39},null,null,null,null,null,{"$f":"'1'!L44:N44","v":"Sum Spesialøvelser"},null,null,{"$f":"IF(Resultatskj!H4=\"Rundering\",J33,IF(Resultatskj!H4=\"Spor\",J28,IF(Resultatskj!H4=\"Rapport\",J44,\"\")))","v":""}]
[null,null,null,null,null,null,null,null,null,null,null,{"$f":"'1'!L45:N45","v":"Totalpoeng"},null,null,{"$f":"SUM(O43:P44)","v":0}]
[null,null,null,null,null,null,null,null,null,null,null,{"$f":"'1'!L46","v":"Ikke godkj."},{"$f":"'1'!M46","v":"Godkj."},null,{"$f":"'1'!O46","v":"Cert"},{"$f":"'1'!P46","v":"Plass"}]
[{"$f":"IF(Resultatskj!C3=\"\",\"\",Resultatskj!C3)","v":""},null,null,null,null,{"$f":"IF(Resultatskj!C4=\"\",\"\",Resultatskj!C4)","v":""},null,null,null,null,null,{"$f":"IF(OR(O45<O35,O44<O36,O43<O37,O45=\"\"),\"X\",\"\")","v":"X"},{"$f":"IF(AND(O45>=O35,O44>=O36,O43>=O37,L47=\"\"),\"X\",\"\")","v":""},null,{"$f":"IF(AND(O45>=575,O44>=311.99,O43>207.99,L47=\"\"),\"X\",\"\")","v":""},{"$f":"Resultatskj!A12","v":"-"}]
["Underskrift dommere",null,null,null,null,null,null,null,null,null,null,{"$f":"Resultatskj!K26","v":"B.Strand/A.Bakken 15.07.2015/19.06.2018"}]
[]
[{"$f":"IF(Resultatskj!$C$3=\"\",\"\",Resultatskj!$C$3)","v":""}]
[{"$f":"IF(Resultatskj!$C$4=\"\",\"\",Resultatskj!$C$4)","v":""}]

{"sheet":"6","index":7,"n_rows":51,"n_cols":16,"rows_kept":51,"cut":false,"hidden":false,"merged":[[50,0,50,9],[26,10,26,15],[25,10,25,15],[9,0,9,15],[14,1,14,4],[24,1,24,4],[25,1,25,4],[14,10,14,15],[16,10,16,15],[17,10,17,15],[20,1,20,4],[21,0,21,4],[10,10,10,15],[11,10,11,15],[12,10,12,15],[41,14,41,15],[3,0,3,1],[3,2,3,9],[3,10,3,11],[3,12,3,15],[4,0,4,1],[1,0,1,1],[0,2,0,4],[2,0,2,1],[2,2,2,9],[2,10,2,11],[38,11,38,13],[35,4,35,9],[36,4,36,9],[0,5,0,15],[1,10,1,12],[1,2,1,5],[2,12,2,15],[4,2,4,9],[4,10,4,11],[4,12,4,15],[23,0,23,4],[23,10,23,15],[24,10,24,15],[41,1,41,4],[34,4,34,9],[40,0,40,4],[41,11,41,13],[34,2,34,3],[39,11,39,13],[39,0,39,3],[39,4,39,9],[35,11,35,13],[37,11,37,13],[36,11,36,13],[38,4,38,9],[37,4,37,9],[10,0,10,4],[13,10,13,15],[11,1,11,4],[12,1,12,4],[13,1,13,4],[18,10,18,15],[18,1,18,4],[33,0,33,15],[15,1,15,4],[15,10,15,15],[16,1,16,4],[17,1,17,4],[22,0,22,15],[29,0,29,4],[31,1,31,4],[19,1,19,4],[19,10,19,15],[20,10,20,15],[21,10,21,15],[30,1,30,4],[28,0,28,15],[34,0,34,1],[34,11,34,13],[26,1,26,4],[32,0,32,4],[27,0,27,4],[27,10,27,15],[32,10,32,15],[31,10,31,15],[30,10,30,15],[29,10,29,15],[42,1,42,4],[43,0,43,4],[44,11,44,13],[42,11,42,13],[44,14,44,15],[43,14,43,15],[43,11,43,13],[42,14,42,15],[44,0,46,9],[49,11,49,15],[47,11,47,15],[45,12,45,13],[46,12,46,13],[47,0,47,9],[49,0,49,9]]}
[null,null,null,null,null,{"$f":"'1'!F1:R1","v":"Kl. A - DOMMERPROTOKOLL"}]
[{"$f":"'1'!A2:B2","v":"Dato:"},null,{"$f":"IF(Resultatskj!L2=\"\",\"\",Resultatskj!L2)","v":""},null,null,null,null,null,null,{"$f":"'1'!J2","v":"Gruppe:"},{"$f":"IF(Resultatskj!H4=\"\",\"\",Resultatskj!H4)","v":"Spor"},null,null,null,"Katalog nr.",{"$f":"Resultatskj!B13","v":""}]
[{"$f":"'1'!A3:B3","v":"Arrangør:"},null,{"$f":"IF(Resultatskj!$C$2=\"\",\"\",Resultatskj!$C$2)","v":"Norsk Brukshundsports Forbund"},null,null,null,null,null,null,null,{"$f":"'1'!K3:L3","v":"Hundens navn:"}]
[{"$f":"'1'!A4:B4","v":"Fører:"},null,null,null,null,null,null,null,null,null,{"$f":"'1'!K4:L4","v":"Reg.nr.:"}]
[{"$f":"'1'!A5:B5","v":"Klubb:"},null,null,null,null,null,null,null,null,null,{"$f":"'1'!K5:L5","v":"Rase:"}]
[]
[null,"Klasse",null,"Liten",null,null,null,null,null,"Middels",null,null,"Stor"]
[]
[]
[{"$f":"'1'!A10","v":"Lydighet:"}]
[{"$f":"'1'!A11","v":"Øvelser:"},null,null,null,null,"Koeff.","Karakter","Karakter","Snitt","Poeng"]
[{"$f":"'1'!A12","v":1},{"$f":"'1'!B12","v":"Fri ved foten"},null,null,null,3,null,null,{"$f":"IF(G12=\"\",\"\",IF(H12=\"\",\"\",(G12+H12)/2))","v":""},{"$f":"IF(I12=\"\",\"\",IF(I12=0,\"I.G.\",I12*F12))","v":""}]
[{"$f":"'1'!A13","v":2},{"$f":"'1'!B13","v":"Innkalling m/stå og dekk"},null,null,null,3,null,null,{"$f":"IF(G13=\"\",\"\",IF(H13=\"\",\"\",(G13+H13)/2))","v":""},{"$f":"IF(I13=\"\",\"\",IF(I13=0,\"I.G.\",I13*F13))","v":""}]
[{"$f":"'1'!A14","v":3},{"$f":"'1'!B14","v":"Fremadsending"},null,null,null,3,null,null,"",""]
[{"$f":"'1'!A15","v":4},{"$f":"'1'!B15","v":"Kryp"},null,null,null,3,null,null,"",""]
[{"$f":"'1'!A16","v":5},{"$f":"'1'!B16","v":"Hals på kommando"},null,null,null,2,null,null,"",""]
[{"$f":"'1'!A17","v":6},{"$f":"'1'!B17","v":"Apportering metallapport"},null,null,null,3,null,null,"",""]
[{"$f":"'1'!A18","v":7},{"$f":"'1'!B18","v":"Apportering tung gjenstand"},null,null,null,3,null,null,"",""]
[{"$f":"'1'!A19","v":8},"Fritt hopp over hinder",null,null,null,2,null,null,"",""]
[{"$f":"'1'!A20","v":9},{"$f":"'1'!B20","v":"Stigeklatring"},null,null,null,2,null,null,"",""]
[{"$f":"'1'!A21","v":10},{"$f":"'1'!B21","v":"Fellesdekk"},null,null,null,2,null,null,"",""]
[{"$f":"'1'!A22","v":"Sum lydighet:"},null,null,null,null,{"$f":"SUM(F12:F21)","v":26},null,null,null,{"$f":"SUM(J12:J21)","v":0}]
[{"$f":"'1'!A23","v":"Sporgruppen:"}]
[{"$f":"'1'!A24","v":"Øvelser:"},null,null,null,null,"Koeff.","Karakter","Karakter","Snitt","Poeng"]
[{"$f":"'1'!A25","v":11},{"$f":"'1'!B25","v":"Feltsøk"},null,null,null,10,null,null,{"$f":"IF(G25=\"\",\"\",IF(H25=\"\",\"\",(G25+H25)/2))","v":""},{"$f":"IF(I25=\"\",\"\",IF(I25=0,\"I.G.\",I25*F25))","v":""}]
[{"$f":"'1'!A26","v":12},{"$f":"'1'!B26","v":"Sporoppsøk"},null,null,null,5,null,null,{"$f":"IF(G26=\"\",\"\",IF(H26=\"\",\"\",(G26+H26)/2))","v":""},{"$f":"IF(I26=\"\",\"\",IF(I26=0,\"I.G.\",I26*F26))","v":""}]
[{"$f":"'1'!A27","v":13},{"$f":"'1'!B27","v":"Spor"},null,null,null,24,null,null,"",""]
[{"$f":"'1'!A28","v":"Sum spesialøvelser:"},null,null,null,null,{"$f":"SUM(F25:F27)","v":39},null,null,null,{"$f":"IF(AND(J25=\"\",J26=\"\",J27=\"\"),\"\",SUM(J25:J27))","v":""}]
[{"$f":"'1'!A29","v":"Runderingsgruppen:"}]
[{"$f":"'1'!A30","v":"Øvelser:"},null,null,null,null,"Koeff.","Karakter","Karakter","Snitt","Poeng"]
[{"$f":"'1'!A31","v":11},{"$f":"'1'!B31","v":"Feltsøk"},null,null,null,10,null,null,{"$f":"IF(G31=\"\",\"\",IF(H31=\"\",\"\",(G31+H31)/2))","v":""},{"$f":"IF(I31=\"\",\"\",IF(I31=0,\"I.G.\",I31*F31))","v":""}]
[{"$f":"'1'!A32","v":12},{"$f":"'1'!B32","v":"Rundering"},null,null,null,{"$f":"'1'!F32","v":29},null,null,{"$f":"IF(G32=\"\",\"\",IF(H32=\"\",\"\",(G32+H32)/2))","v":""},{"$f":"IF(I32=\"\",\"\",IF(I32=0,\"I.G.\",I32*F32))","v":""}]
[{"$f":"'1'!A33","v":"Sum spesialøvelser:"},null,null,null,null,{"$f":"SUM(F31:F32)","v":39},null,null,null,{"$f":"IF(AND(J31=\"\",J32=\"\"),\"\",SUM(J31:J32))","v":""},null,"Godkjent",null,null,300,"poeng"]
[{"$f":"'1'!A34","v":"Rapportgruppen:"}]
[{"$f":"'1'!A35","v":"Start kl.:"},0,{"$f":"'1'!C35","v":"Ankomst kl.:"},0,{"$f":"'1'!E35:J35","v":"Anvendt tid:"},null,null,null,null,null,null,{"$f":"'1'!L35:N35","v":"Godkjent"},null,null,{"$f":"'1'!O35","v":325},{"$f":"'1'!P35","v":"poeng"}]
[{"$f":"'1'!A36","v":"B"},"00:00:00",{"$f":"'1'!C36","v":"A"},"00:00:00",{"$f":"SUM(B36,D36)","v":"00:00:00"},null,null,null,null,null,null,{"$f":"'1'!L36:N36","v":"- Derav i spesialøvelsene"},null,null,195,{"$f":"'1'!P36","v":"poeng"}]
[{"$f":"'1'!A37","v":"A"},"00:00:00",{"$f":"'1'!C37","v":"B"},"00:00:00",{"$f":"SUM(B37,D37)","v":"00:00:00"},null,null,null,null,null,null,"- Derav i lydighetsøvelsene",null,null,130,{"$f":"'1'!P37","v":"poeng"}]
[{"$f":"'1'!A38","v":"C"},"00:00:00",{"$f":"'1'!C38","v":"A"},"00:00:00",{"$f":"SUM(B38,D38)","v":"00:00:00"},null,null,null,null,null,null,{"$f":"'1'!L38:N38","v":"Cert/CACIT"},null,null,575,{"$f":"'1'!P38","v":"poeng"}]
[{"$f":"'1'!A39","v":"A"},"00:00:00",{"$f":"'1'!C39","v":"D"},"00:00:00",{"$f":"SUM(E35:J38)","v":"00:00:00"},null,null,null,null,null,null,{"$f":"'1'!L39:N39","v":"- Derav i spesialøvelsene"},null,null,312,{"$f":"'1'!P39","v":"poeng"}]
[{"$f":"'1'!A40","v":"Anvendt tid totalt:"},null,null,null,{"$f":"SUM(E36:J39)","v":"00:00:00"},null,null,null,null,null,null,{"$f":"'1'!L40:N40","v":"- Derav i lydighetsøvelsene"},null,null,208,{"$f":"'1'!P40","v":"poeng"}]
[{"$f":"'1'!A41","v":"Øvelser:"},null,null,null,null,{"$f":"'1'!F41","v":"Koeff."},{"$f":"'1'!G41","v":"Karakter"},{"$f":"'1'!H41","v":"Karakter"},"Snitt",{"$f":"'1'!J41","v":"Poeng"}]
[{"$f":"'1'!A42","v":11},{"$f":"'1'!B42","v":"Feltsøk"},null,null,null,10,null,null,{"$f":"IF(G42=\"\",\"\",IF(H42=\"\",\"\",(G42+H42)/2))","v":""},{"$f":"IF(I42=\"\",\"\",IF(I42=0,\"I.G.\",I42*F42))","v":""},null,null,null,null,{"$f":"'1'!O42:P42","v":"Poeng"}]
[{"$f":"'1'!A43","v":12},{"$f":"'1'!B43","v":"Rapport"},null,null,null,{"$f":"'1'!F43","v":29},null,null,{"$f":"IF(G43=\"\",\"\",IF(H43=\"\",\"\",(G43+H43)/2))","v":""},{"$f":"IF(I43=\"\",\"\",IF(I43=0,\"I.G.\",I43*F43))","v":""},null,{"$f":"'1'!L43:N43","v":"Sum Lydighet"},null,null,{"$f":"J22","v":0}]
[{"$f":"'1'!A44","v":"Sum spesialøvelser:"},null,null,null,null,{"$f":"SUM(F42:F43)","v":39},null,null,null,null,null,{"$f":"'1'!L44:N44","v":"Sum Spesialøvelser"},null,null,{"$f":"IF(Resultatskj!H4=\"Rundering\",J33,IF(Resultatskj!H4=\"Spor\",J28,IF(Resultatskj!H4=\"Rapport\",J44,\"\")))","v":""}]
[null,null,null,null,null,null,null,null,null,null,null,{"$f":"'1'!L45:N45","v":"Totalpoeng"},null,null,{"$f":"SUM(O43:P44)","v":0}]
[null,null,null,null,null,null,null,null,null,null,null,{"$f":"'1'!L46","v":"Ikke godkj."},{"$f":"'1'!M46","v":"Godkj."},null,{"$f":"'1'!O46","v":"Cert"},{"$f":"'1'!P46","v":"Plass"}]
[{"$f":"IF(Resultatskj!C3=\"\",\"\",Resultatskj!C3)","v":""},null,null,null,null,{"$f":"IF(Resultatskj!C4=\"\",\"\",Resultatskj!C4)","v":""},null,null,null,null,null,{"$f":"IF(OR(O45<O35,O44<O36,O43<O37,O45=\"\"),\"X\",\"\")","v":"X"},{"$f":"IF(AND(O45>=O35,O44>=O36,O43>=O37,L47=\"\"),\"X\",\"\")","v":""},null,{"$f":"IF(AND(O45>=575,O44>=311.99,O43>207.99,L47=\"\"),\"X\",\"\")","v":""},{"$f":"Resultatskj!A13","v":"-"}]
["Underskrift dommere",null,null,null,null,null,null,null,null,null,null,{"$f":"Resultatskj!K26","v":"B.Strand/A.Bakken 15.07.2015/19.06.2018"}]
[]
[{"$f":"IF(Resultatskj!$C$3=\"\",\"\",Resultatskj!$C$3)","v":""}]
[{"$f":"IF(Resultatskj!$C$4=\"\",\"\",Resultatskj!$C$4)","v":""}]

{"sheet":"7","index":8,"n_rows":51,"n_cols":16,"rows_kept":51,"cut":false,"hidden":false,"merged":[[50,0,50,9],[16,10,16,15],[18,1,18,4],[15,10,15,15],[17,10,17,15],[30,1,30,4],[23,10,23,15],[24,10,24,15],[30,10,30,15],[25,10,25,15],[29,10,29,15],[18,10,18,15],[20,10,20,15],[21,10,21,15],[22,0,22,15],[19,10,19,15],[0,5,0,15],[26,10,26,15],[43,11,43,13],[2,2,2,9],[36,4,36,9],[38,11,38,13],[37,11,37,13],[37,4,37,9],[31,10,31,15],[2,12,2,15],[14,10,14,15],[9,0,9,15],[14,1,14,4],[2,0,2,1],[2,10,2,11],[15,1,15,4],[1,0,1,1],[1,2,1,5],[1,10,1,12],[3,10,3,11],[3,0,3,1],[3,2,3,9],[3,12,3,15],[4,0,4,1],[4,2,4,9],[4,10,4,11],[4,12,4,15],[13,1,13,4],[13,10,13,15],[12,10,12,15],[10,0,10,4],[10,10,10,15],[11,1,11,4],[11,10,11,15],[33,0,33,15],[34,0,34,1],[34,2,34,3],[39,0,39,3],[39,4,39,9],[35,11,35,13],[35,4,35,9],[38,4,38,9],[32,10,32,15],[27,10,27,15],[28,0,28,15],[29,0,29,4],[31,1,31,4],[32,0,32,4],[23,0,23,4],[26,1,26,4],[27,0,27,4],[16,1,16,4],[17,1,17,4],[24,1,24,4],[25,1,25,4],[20,1,20,4],[21,0,21,4],[19,1,19,4],[0,2,0,4],[42,14,42,15],[42,11,42,13],[45,12,45,13],[46,12,46,13],[34,4,34,9],[34,11,34,13],[44,0,46,9],[44,11,44,13],[44,14,44,15],[43,14,43,15],[40,0,40,4],[41,11,41,13],[41,14,41,15],[41,1,41,4],[12,1,12,4],[49,11,49,15],[47,11,47,15],[36,11,36,13],[42,1,42,4],[43,0,43,4],[47,0,47,9],[39,11,39,13],[49,0,49,9]]}
[null,null,null,null,null,{"$f":"'1'!F1:R1","v":"Kl. A - DOMMERPROTOKOLL"}]
[{"$f":"'1'!A2:B2","v":"Dato:"},null,{"$f":"IF(Resultatskj!L2=\"\",\"\",Resultatskj!L2)","v":""},null,null,null,null,null,null,{"$f":"'1'!J2","v":"Gruppe:"},{"$f":"IF(Resultatskj!H4=\"\",\"\",Resultatskj!H4)","v":"Spor"},null,null,null,"Katalog nr.",{"$f":"Resultatskj!B14","v":""}]
[{"$f":"'1'!A3:B3","v":"Arrangør:"},null,{"$f":"IF(Resultatskj!$C$2=\"\",\"\",Resultatskj!$C$2)","v":"Norsk Brukshundsports Forbund"},null,null,null,null,null,null,null,{"$f":"'1'!K3:L3","v":"Hundens navn:"}]
[{"$f":"'1'!A4:B4","v":"Fører:"},null,null,null,null,null,null,null,null,null,{"$f":"'1'!K4:L4","v":"Reg.nr.:"}]
[{"$f":"'1'!A5:B5","v":"Klubb:"},null,null,null,null,null,null,null,null,null,{"$f":"'1'!K5:L5","v":"Rase:"}]
[]
[null,"Klasse",null,"Liten",null,null,null,null,null,"Middels",null,null,"Stor"]
[]
[]
[{"$f":"'1'!A10","v":"Lydighet:"}]
[{"$f":"'1'!A11","v":"Øvelser:"},null,null,null,null,"Koeff.","Karakter","Karakter","Snitt","Poeng"]
[{"$f":"'1'!A12","v":1},{"$f":"'1'!B12","v":"Fri ved foten"},null,null,null,3,null,null,{"$f":"IF(G12=\"\",\"\",IF(H12=\"\",\"\",(G12+H12)/2))","v":""},{"$f":"IF(I12=\"\",\"\",IF(I12=0,\"I.G.\",I12*F12))","v":""}]
[{"$f":"'1'!A13","v":2},{"$f":"'1'!B13","v":"Innkalling m/stå og dekk"},null,null,null,3,null,null,{"$f":"IF(G13=\"\",\"\",IF(H13=\"\",\"\",(G13+H13)/2))","v":""},{"$f":"IF(I13=\"\",\"\",IF(I13=0,\"I.G.\",I13*F13))","v":""}]
[{"$f":"'1'!A14","v":3},{"$f":"'1'!B14","v":"Fremadsending"},null,null,null,3,null,null,"",""]
[{"$f":"'1'!A15","v":4},{"$f":"'1'!B15","v":"Kryp"},null,null,null,3,null,null,"",""]
[{"$f":"'1'!A16","v":5},{"$f":"'1'!B16","v":"Hals på kommando"},null,null,null,2,null,null,"",""]
[{"$f":"'1'!A17","v":6},{"$f":"'1'!B17","v":"Apportering metallapport"},null,null,null,3,null,null,"",""]
[{"$f":"'1'!A18","v":7},{"$f":"'1'!B18","v":"Apportering tung gjenstand"},null,null,null,3,null,null,"",""]
[{"$f":"'1'!A19","v":8},"Fritt hopp over hinder",null,null,null,2,null,null,"",""]
[{"$f":"'1'!A20","v":9},{"$f":"'1'!B20","v":"Stigeklatring"},null,null,null,2,null,null,"",""]
[{"$f":"'1'!A21","v":10},{"$f":"'1'!B21","v":"Fellesdekk"},null,null,null,2,null,null,"",""]
[{"$f":"'1'!A22","v":"Sum lydighet:"},null,null,null,null,{"$f":"SUM(F12:F21)","v":26},null,null,null,{"$f":"SUM(J12:J21)","v":0}]
[{"$f":"'1'!A23","v":"Sporgruppen:"}]
[{"$f":"'1'!A24","v":"Øvelser:"},null,null,null,null,"Koeff.","Karakter","Karakter","Snitt","Poeng"]
[{"$f":"'1'!A25","v":11},{"$f":"'1'!B25","v":"Feltsøk"},null,null,null,10,null,null,{"$f":"IF(G25=\"\",\"\",IF(H25=\"\",\"\",(G25+H25)/2))","v":""},{"$f":"IF(I25=\"\",\"\",IF(I25=0,\"I.G.\",I25*F25))","v":""}]
[{"$f":"'1'!A26","v":12},{"$f":"'1'!B26","v":"Sporoppsøk"},null,null,null,5,null,null,{"$f":"IF(G26=\"\",\"\",IF(H26=\"\",\"\",(G26+H26)/2))","v":""},{"$f":"IF(I26=\"\",\"\",IF(I26=0,\"I.G.\",I26*F26))","v":""}]
[{"$f":"'1'!A27","v":13},{"$f":"'1'!B27","v":"Spor"},null,null,null,24,null,null,"",""]
[{"$f":"'1'!A28","v":"Sum spesialøvelser:"},null,null,null,null,{"$f":"SUM(F25:F27)","v":39},null,null,null,{"$f":"IF(AND(J25=\"\",J26=\"\",J27=\"\"),\"\",SUM(J25:J27))","v":""}]
[{"$f":"'1'!A29","v":"Runderingsgruppen:"}]
[{"$f":"'1'!A30","v":"Øvelser:"},null,null,null,null,"Koeff.","Karakter","Karakter","Snitt","Poeng"]
[{"$f":"'1'!A31","v":11},{"$f":"'1'!B31","v":"Feltsøk"},null,null,null,10,null,null,{"$f":"IF(G31=\"\",\"\",IF(H31=\"\",\"\",(G31+H31)/2))","v":""},{"$f":"IF(I31=\"\",\"\",IF(I31=0,\"I.G.\",I31*F31))","v":""}]
[{"$f":"'1'!A32","v":12},{"$f":"'1'!B32","v":"Rundering"},null,null,null,{"$f":"'1'!F32","v":29},null,null,{"$f":"IF(G32=\"\",\"\",IF(H32=\"\",\"\",(G32+H32)/2))","v":""},{"$f":"IF(I32=\"\",\"\",IF(I32=0,\"I.G.\",I32*F32))","v":""}]
[{"$f":"'1'!A33","v":"Sum spesialøvelser:"},null,null,null,null,{"$f":"SUM(F31:F32)","v":39},null,null,null,{"$f":"IF(AND(J31=\"\",J32=\"\"),\"\",SUM(J31:J32))","v":""},null,"Godkjent",null,null,300,"poeng"]
[{"$f":"'1'!A34","v":"Rapportgruppen:"}]
[{"$f":"'1'!A35","v":"Start kl.:"},0,{"$f":"'1'!C35","v":"Ankomst kl.:"},0,{"$f":"'1'!E35:J35","v":"Anvendt tid:"},null,null,null,null,null,null,{"$f":"'1'!L35:N35","v":"Godkjent"},null,null,{"$f":"'1'!O35","v":325},{"$f":"'1'!P35","v":"poeng"}]
[{"$f":"'1'!A36","v":"B"},"00:00:00",{"$f":"'1'!C36","v":"A"},"00:00:00",{"$f":"SUM(B36,D36)","v":"00:00:00"},null,null,null,null,null,null,{"$f":"'1'!L36:N36","v":"- Derav i spesialøvelsene"},null,null,195,{"$f":"'1'!P36","v":"poeng"}]
[{"$f":"'1'!A37","v":"A"},"00:00:00",{"$f":"'1'!C37","v":"B"},"00:00:00",{"$f":"SUM(B37,D37)","v":"00:00:00"},null,null,null,null,null,null,"- Derav i lydighetsøvelsene",null,null,130,{"$f":"'1'!P37","v":"poeng"}]
[{"$f":"'1'!A38","v":"C"},"00:00:00",{"$f":"'1'!C38","v":"A"},"00:00:00",{"$f":"SUM(B38,D38)","v":"00:00:00"},null,null,null,null,null,null,{"$f":"'1'!L38:N38","v":"Cert/CACIT"},null,null,575,{"$f":"'1'!P38","v":"poeng"}]
[{"$f":"'1'!A39","v":"A"},"00:00:00",{"$f":"'1'!C39","v":"D"},"00:00:00",{"$f":"SUM(E35:J38)","v":"00:00:00"},null,null,null,null,null,null,{"$f":"'1'!L39:N39","v":"- Derav i spesialøvelsene"},null,null,312,{"$f":"'1'!P39","v":"poeng"}]
[{"$f":"'1'!A40","v":"Anvendt tid totalt:"},null,null,null,{"$f":"SUM(E36:J39)","v":"00:00:00"},null,null,null,null,null,null,{"$f":"'1'!L40:N40","v":"- Derav i lydighetsøvelsene"},null,null,208,{"$f":"'1'!P40","v":"poeng"}]
[{"$f":"'1'!A41","v":"Øvelser:"},null,null,null,null,{"$f":"'1'!F41","v":"Koeff."},{"$f":"'1'!G41","v":"Karakter"},{"$f":"'1'!H41","v":"Karakter"},"Snitt",{"$f":"'1'!J41","v":"Poeng"}]
[{"$f":"'1'!A42","v":11},{"$f":"'1'!B42","v":"Feltsøk"},null,null,null,10,null,null,{"$f":"IF(G42=\"\",\"\",IF(H42=\"\",\"\",(G42+H42)/2))","v":""},{"$f":"IF(I42=\"\",\"\",IF(I42=0,\"I.G.\",I42*F42))","v":""},null,null,null,null,{"$f":"'1'!O42:P42","v":"Poeng"}]
[{"$f":"'1'!A43","v":12},{"$f":"'1'!B43","v":"Rapport"},null,null,null,{"$f":"'1'!F43","v":29},null,null,{"$f":"IF(G43=\"\",\"\",IF(H43=\"\",\"\",(G43+H43)/2))","v":""},{"$f":"IF(I43=\"\",\"\",IF(I43=0,\"I.G.\",I43*F43))","v":""},null,{"$f":"'1'!L43:N43","v":"Sum Lydighet"},null,null,{"$f":"J22","v":0}]
[{"$f":"'1'!A44","v":"Sum spesialøvelser:"},null,null,null,null,{"$f":"SUM(F42:F43)","v":39},null,null,null,null,null,{"$f":"'1'!L44:N44","v":"Sum Spesialøvelser"},null,null,{"$f":"IF(Resultatskj!H4=\"Rundering\",J33,IF(Resultatskj!H4=\"Spor\",J28,IF(Resultatskj!H4=\"Rapport\",J44,\"\")))","v":""}]
[null,null,null,null,null,null,null,null,null,null,null,{"$f":"'1'!L45:N45","v":"Totalpoeng"},null,null,{"$f":"SUM(O43:P44)","v":0}]
[null,null,null,null,null,null,null,null,null,null,null,{"$f":"'1'!L46","v":"Ikke godkj."},{"$f":"'1'!M46","v":"Godkj."},null,{"$f":"'1'!O46","v":"Cert"},{"$f":"'1'!P46","v":"Plass"}]
[{"$f":"IF(Resultatskj!C3=\"\",\"\",Resultatskj!C3)","v":""},null,null,null,null,{"$f":"IF(Resultatskj!C4=\"\",\"\",Resultatskj!C4)","v":""},null,null,null,null,null,{"$f":"IF(OR(O45<O35,O44<O36,O43<O37,O45=\"\"),\"X\",\"\")","v":"X"},{"$f":"IF(AND(O45>=O35,O44>=O36,O43>=O37,L47=\"\"),\"X\",\"\")","v":""},null,{"$f":"IF(AND(O45>=575,O44>=311.99,O43>207.99,L47=\"\"),\"X\",\"\")","v":""},{"$f":"Resultatskj!A14","v":"-"}]
["Underskrift dommere",null,null,null,null,null,null,null,null,null,null,{"$f":"Resultatskj!K26","v":"B.Strand/A.Bakken 15.07.2015/19.06.2018"}]
[]
[{"$f":"IF(Resultatskj!$C$3=\"\",\"\",Resultatskj!$C$3)","v":""}]
[{"$f":"IF(Resultatskj!$C$4=\"\",\"\",Resultatskj!$C$4)","v":""}]

{"sheet":"8","index":9,"n_rows":51,"n_cols":16,"rows_kept":51,"cut":false,"hidden":false,"merged":[[50,0,50,9],[26,10,26,15],[25,10,25,15],[9,0,9,15],[14,1,14,4],[24,1,24,4],[25,1,25,4],[14,10,14,15],[16,10,16,15],[17,10,17,15],[20,1,20,4],[21,0,21,4],[10,10,10,15],[11,10,11,15],[12,10,12,15],[41,14,41,15],[3,0,3,1],[3,2,3,9],[3,10,3,11],[3,12,3,15],[4,0,4,1],[1,0,1,1],[0,2,0,4],[2,0,2,1],[2,2,2,9],[2,10,2,11],[38,11,38,13],[35,4,35,9],[36,4,36,9],[0,5,0,15],[1,10,1,12],[1,2,1,5],[2,12,2,15],[4,2,4,9],[4,10,4,11],[4,12,4,15],[23,0,23,4],[23,10,23,15],[24,10,24,15],[41,1,41,4],[34,4,34,9],[40,0,40,4],[41,11,41,13],[34,2,34,3],[39,11,39,13],[39,0,39,3],[39,4,39,9],[35,11,35,13],[37,11,37,13],[36,11,36,13],[38,4,38,9],[37,4,37,9],[10,0,10,4],[13,10,13,15],[11,1,11,4],[12,1,12,4],[13,1,13,4],[18,10,18,15],[18,1,18,4],[33,0,33,15],[15,1,15,4],[15,10,15,15],[16,1,16,4],[17,1,17,4],[22,0,22,15],[29,0,29,4],[31,1,31,4],[19,1,19,4],[19,10,19,15],[20,10,20,15],[21,10,21,15],[30,1,30,4],[28,0,28,15],[34,0,34,1],[34,11,34,13],[26,1,26,4],[32,0,32,4],[27,0,27,4],[27,10,27,15],[32,10,32,15],[31,10,31,15],[30,10,30,15],[29,10,29,15],[42,1,42,4],[43,0,43,4],[44,11,44,13],[42,11,42,13],[44,14,44,15],[43,14,43,15],[43,11,43,13],[42,14,42,15],[44,0,46,9],[49,11,49,15],[47,11,47,15],[45,12,45,13],[46,12,46,13],[47,0,47,9],[49,0,49,9]]}
[null,null,null,null,null,{"$f":"'1'!F1:R1","v":"Kl. A - DOMMERPROTOKOLL"}]
[{"$f":"'1'!A2:B2","v":"Dato:"},null,{"$f":"IF(Resultatskj!L2=\"\",\"\",Resultatskj!L2)","v":""},null,null,null,null,null,null,{"$f":"'1'!J2","v":"Gruppe:"},{"$f":"IF(Resultatskj!H4=\"\",\"\",Resultatskj!H4)","v":"Spor"},null,null,null,"Katalog nr.",{"$f":"Resultatskj!B15","v":""}]
[{"$f":"'1'!A3:B3","v":"Arrangør:"},null,{"$f":"IF(Resultatskj!$C$2=\"\",\"\",Resultatskj!$C$2)","v":"Norsk Brukshundsports Forbund"},null,null,null,null,null,null,null,{"$f":"'1'!K3:L3","v":"Hundens navn:"}]
[{"$f":"'1'!A4:B4","v":"Fører:"},null,null,null,null,null,null,null,null,null,{"$f":"'1'!K4:L4","v":"Reg.nr.:"}]
[{"$f":"'1'!A5:B5","v":"Klubb:"},null,null,null,null,null,null,null,null,null,{"$f":"'1'!K5:L5","v":"Rase:"}]
[]
[null,"Klasse",null,"Liten",null,null,null,null,null,"Middels",null,null,"Stor"]
[]
[]
[{"$f":"'1'!A10","v":"Lydighet:"}]
[{"$f":"'1'!A11","v":"Øvelser:"},null,null,null,null,"Koeff.","Karakter","Karakter","Snitt","Poeng"]
[{"$f":"'1'!A12","v":1},{"$f":"'1'!B12","v":"Fri ved foten"},null,null,null,3,null,null,{"$f":"IF(G12=\"\",\"\",IF(H12=\"\",\"\",(G12+H12)/2))","v":""},{"$f":"IF(I12=\"\",\"\",IF(I12=0,\"I.G.\",I12*F12))","v":""}]
[{"$f":"'1'!A13","v":2},{"$f":"'1'!B13","v":"Innkalling m/stå og dekk"},null,null,null,3,null,null,{"$f":"IF(G13=\"\",\"\",IF(H13=\"\",\"\",(G13+H13)/2))","v":""},{"$f":"IF(I13=\"\",\"\",IF(I13=0,\"I.G.\",I13*F13))","v":""}]
[{"$f":"'1'!A14","v":3},{"$f":"'1'!B14","v":"Fremadsending"},null,null,null,3,null,null,"",""]
[{"$f":"'1'!A15","v":4},{"$f":"'1'!B15","v":"Kryp"},null,null,null,3,null,null,"",""]
[{"$f":"'1'!A16","v":5},{"$f":"'1'!B16","v":"Hals på kommando"},null,null,null,2,null,null,"",""]
[{"$f":"'1'!A17","v":6},{"$f":"'1'!B17","v":"Apportering metallapport"},null,null,null,3,null,null,"",""]
[{"$f":"'1'!A18","v":7},{"$f":"'1'!B18","v":"Apportering tung gjenstand"},null,null,null,3,null,null,"",""]
[{"$f":"'1'!A19","v":8},"Fritt hopp over hinder",null,null,null,2,null,null,"",""]
[{"$f":"'1'!A20","v":9},{"$f":"'1'!B20","v":"Stigeklatring"},null,null,null,2,null,null,"",""]
[{"$f":"'1'!A21","v":10},{"$f":"'1'!B21","v":"Fellesdekk"},null,null,null,2,null,null,"",""]
[{"$f":"'1'!A22","v":"Sum lydighet:"},null,null,null,null,{"$f":"SUM(F12:F21)","v":26},null,null,null,{"$f":"SUM(J12:J21)","v":0}]
[{"$f":"'1'!A23","v":"Sporgruppen:"}]
[{"$f":"'1'!A24","v":"Øvelser:"},null,null,null,null,"Koeff.","Karakter","Karakter","Snitt","Poeng"]
[{"$f":"'1'!A25","v":11},{"$f":"'1'!B25","v":"Feltsøk"},null,null,null,10,null,null,{"$f":"IF(G25=\"\",\"\",IF(H25=\"\",\"\",(G25+H25)/2))","v":""},{"$f":"IF(I25=\"\",\"\",IF(I25=0,\"I.G.\",I25*F25))","v":""}]
[{"$f":"'1'!A26","v":12},{"$f":"'1'!B26","v":"Sporoppsøk"},null,null,null,5,null,null,{"$f":"IF(G26=\"\",\"\",IF(H26=\"\",\"\",(G26+H26)/2))","v":""},{"$f":"IF(I26=\"\",\"\",IF(I26=0,\"I.G.\",I26*F26))","v":""}]
[{"$f":"'1'!A27","v":13},{"$f":"'1'!B27","v":"Spor"},null,null,null,24,null,null,"",""]
[{"$f":"'1'!A28","v":"Sum spesialøvelser:"},null,null,null,null,{"$f":"SUM(F25:F27)","v":39},null,null,null,{"$f":"IF(AND(J25=\"\",J26=\"\",J27=\"\"),\"\",SUM(J25:J27))","v":""}]
[{"$f":"'1'!A29","v":"Runderingsgruppen:"}]
[{"$f":"'1'!A30","v":"Øvelser:"},null,null,null,null,"Koeff.","Karakter","Karakter","Snitt","Poeng"]
[{"$f":"'1'!A31","v":11},{"$f":"'1'!B31","v":"Feltsøk"},null,null,null,10,null,null,{"$f":"IF(G31=\"\",\"\",IF(H31=\"\",\"\",(G31+H31)/2))","v":""},{"$f":"IF(I31=\"\",\"\",IF(I31=0,\"I.G.\",I31*F31))","v":""}]
[{"$f":"'1'!A32","v":12},{"$f":"'1'!B32","v":"Rundering"},null,null,null,{"$f":"'1'!F32","v":29},null,null,{"$f":"IF(G32=\"\",\"\",IF(H32=\"\",\"\",(G32+H32)/2))","v":""},{"$f":"IF(I32=\"\",\"\",IF(I32=0,\"I.G.\",I32*F32))","v":""}]
[{"$f":"'1'!A33","v":"Sum spesialøvelser:"},null,null,null,null,{"$f":"SUM(F31:F32)","v":39},null,null,null,{"$f":"IF(AND(J31=\"\",J32=\"\"),\"\",SUM(J31:J32))","v":""},null,"Godkjent",null,null,300,"poeng"]
[{"$f":"'1'!A34","v":"Rapportgruppen:"}]
[{"$f":"'1'!A35","v":"Start kl.:"},0,{"$f":"'1'!C35","v":"Ankomst kl.:"},0,{"$f":"'1'!E35:J35","v":"Anvendt tid:"},null,null,null,null,null,null,{"$f":"'1'!L35:N35","v":"Godkjent"},null,null,{"$f":"'1'!O35","v":325},{"$f":"'1'!P35","v":"poeng"}]
[{"$f":"'1'!A36","v":"B"},"00:00:00",{"$f":"'1'!C36","v":"A"},"00:00:00",{"$f":"SUM(B36,D36)","v":"00:00:00"},null,null,null,null,null,null,{"$f":"'1'!L36:N36","v":"- Derav i spesialøvelsene"},null,null,195,{"$f":"'1'!P36","v":"poeng"}]
[{"$f":"'1'!A37","v":"A"},"00:00:00",{"$f":"'1'!C37","v":"B"},"00:00:00",{"$f":"SUM(B37,D37)","v":"00:00:00"},null,null,null,null,null,null,"- Derav i lydighetsøvelsene",null,null,130,{"$f":"'1'!P37","v":"poeng"}]
[{"$f":"'1'!A38","v":"C"},"00:00:00",{"$f":"'1'!C38","v":"A"},"00:00:00",{"$f":"SUM(B38,D38)","v":"00:00:00"},null,null,null,null,null,null,{"$f":"'1'!L38:N38","v":"Cert/CACIT"},null,null,575,{"$f":"'1'!P38","v":"poeng"}]
[{"$f":"'1'!A39","v":"A"},"00:00:00",{"$f":"'1'!C39","v":"D"},"00:00:00",{"$f":"SUM(E35:J38)","v":"00:00:00"},null,null,null,null,null,null,{"$f":"'1'!L39:N39","v":"- Derav i spesialøvelsene"},null,null,312,{"$f":"'1'!P39","v":"poeng"}]
[{"$f":"'1'!A40","v":"Anvendt tid totalt:"},null,null,null,{"$f":"SUM(E36:J39)","v":"00:00:00"},null,null,null,null,null,null,{"$f":"'1'!L40:N40","v":"- Derav i lydighetsøvelsene"},null,null,208,{"$f":"'1'!P40","v":"poeng"}]
[{"$f":"'1'!A41","v":"Øvelser:"},null,null,null,null,{"$f":"'1'!F41","v":"Koeff."},{"$f":"'1'!G41","v":"Karakter"},{"$f":"'1'!H41","v":"Karakter"},"Snitt",{"$f":"'1'!J41","v":"Poeng"}]
[{"$f":"'1'!A42","v":11},{"$f":"'1'!B42","v":"Feltsøk"},null,null,null,10,null,null,{"$f":"IF(G42=\"\",\"\",IF(H42=\"\",\"\",(G42+H42)/2))","v":""},{"$f":"IF(I42=\"\",\"\",IF(I42=0,\"I.G.\",I42*F42))","v":""},null,null,null,null,{"$f":"'1'!O42:P42","v":"Poeng"}]
[{"$f":"'1'!A43","v":12},{"$f":"'1'!B43","v":"Rapport"},null,null,null,{"$f":"'1'!F43","v":29},null,null,{"$f":"IF(G43=\"\",\"\",IF(H43=\"\",\"\",(G43+H43)/2))","v":""},{"$f":"IF(I43=\"\",\"\",IF(I43=0,\"I.G.\",I43*F43))","v":""},null,{"$f":"'1'!L43:N43","v":"Sum Lydighet"},null,null,{"$f":"J22","v":0}]
[{"$f":"'1'!A44","v":"Sum spesialøvelser:"},null,null,null,null,{"$f":"SUM(F42:F43)","v":39},null,null,null,null,null,{"$f":"'1'!L44:N44","v":"Sum Spesialøvelser"},null,null,{"$f":"IF(Resultatskj!H4=\"Rundering\",J33,IF(Resultatskj!H4=\"Spor\",J28,IF(Resultatskj!H4=\"Rapport\",J44,\"\")))","v":""}]
[null,null,null,null,null,null,null,null,null,null,null,{"$f":"'1'!L45:N45","v":"Totalpoeng"},null,null,{"$f":"SUM(O43:P44)","v":0}]
[null,null,null,null,null,null,null,null,null,null,null,{"$f":"'1'!L46","v":"Ikke godkj."},{"$f":"'1'!M46","v":"Godkj."},null,{"$f":"'1'!O46","v":"Cert"},{"$f":"'1'!P46","v":"Plass"}]
[{"$f":"IF(Resultatskj!C3=\"\",\"\",Resultatskj!C3)","v":""},null,null,null,null,{"$f":"IF(Resultatskj!C4=\"\",\"\",Resultatskj!C4)","v":""},null,null,null,null,null,{"$f":"IF(OR(O45<O35,O44<O36,O43<O37,O45=\"\"),\"X\",\"\")","v":"X"},{"$f":"IF(AND(O45>=O35,O44>=O36,O43>=O37,L47=\"\"),\"X\",\"\")","v":""},null,{"$f":"IF(AND(O45>=575,O44>=311.99,O43>207.99,L47=\"\"),\"X\",\"\")","v":""},{"$f":"Resultatskj!A15","v":"-"}]
["Underskrift dommere",null,null,null,null,null,null,null,null,null,null,{"$f":"Resultatskj!K26","v":"B.Strand/A.Bakken 15.07.2015/19.06.2018"}]
[]
[{"$f":"IF(Resultatskj!$C$3=\"\",\"\",Resultatskj!$C$3)","v":""}]
[{"$f":"IF(Resultatskj!$C$4=\"\",\"\",Resultatskj!$C$4)","v":""}]

{"sheet":"9","index":10,"n_rows":51,"n_cols":16,"rows_kept":51,"cut":false,"hidden":false,"merged":[[50,0,50,9],[16,10,16,15],[18,1,18,4],[15,10,15,15],[17,10,17,15],[30,1,30,4],[23,10,23,15],[24,10,24,15],[30,10,30,15],[25,10,25,15],[29,10,29,15],[18,10,18,15],[20,10,20,15],[21,10,21,15],[22,0,22,15],[19,10,19,15],[0,5,0,15],[26,10,26,15],[43,11,43,13],[2,2,2,9],[36,4,36,9],[38,11,38,13],[37,11,37,13],[37,4,37,9],[31,10,31,15],[2,12,2,15],[14,10,14,15],[9,0,9,15],[14,1,14,4],[2,0,2,1],[2,10,2,11],[15,1,15,4],[1,0,1,1],[1,2,1,5],[1,10,1,12],[3,10,3,11],[3,0,3,1],[3,2,3,9],[3,12,3,15],[4,0,4,1],[4,2,4,9],[4,10,4,11],[4,12,4,15],[13,1,13,4],[13,10,13,15],[12,10,12,15],[10,0,10,4],[10,10,10,15],[11,1,11,4],[11,10,11,15],[33,0,33,15],[34,0,34,1],[34,2,34,3],[39,0,39,3],[39,4,39,9],[35,11,35,13],[35,4,35,9],[38,4,38,9],[32,10,32,15],[27,10,27,15],[28,0,28,15],[29,0,29,4],[31,1,31,4],[32,0,32,4],[23,0,23,4],[26,1,26,4],[27,0,27,4],[16,1,16,4],[17,1,17,4],[24,1,24,4],[25,1,25,4],[20,1,20,4],[21,0,21,4],[19,1,19,4],[0,2,0,4],[42,14,42,15],[42,11,42,13],[45,12,45,13],[46,12,46,13],[34,4,34,9],[34,11,34,13],[44,0,46,9],[44,11,44,13],[44,14,44,15],[43,14,43,15],[40,0,40,4],[41,11,41,13],[41,14,41,15],[41,1,41,4],[12,1,12,4],[49,11,49,15],[47,11,47,15],[36,11,36,13],[42,1,42,4],[43,0,43,4],[47,0,47,9],[39,11,39,13],[49,0,49,9]]}
[null,null,null,null,null,{"$f":"'1'!F1:R1","v":"Kl. A - DOMMERPROTOKOLL"}]
[{"$f":"'1'!A2:B2","v":"Dato:"},null,{"$f":"IF(Resultatskj!L2=\"\",\"\",Resultatskj!L2)","v":""},null,null,null,null,null,null,{"$f":"'1'!J2","v":"Gruppe:"},{"$f":"IF(Resultatskj!H4=\"\",\"\",Resultatskj!H4)","v":"Spor"},null,null,null,"Katalog nr.",{"$f":"Resultatskj!B16","v":""}]
[{"$f":"'1'!A3:B3","v":"Arrangør:"},null,{"$f":"IF(Resultatskj!$C$2=\"\",\"\",Resultatskj!$C$2)","v":"Norsk Brukshundsports Forbund"},null,null,null,null,null,null,null,{"$f":"'1'!K3:L3","v":"Hundens navn:"}]
[{"$f":"'1'!A4:B4","v":"Fører:"},null,null,null,null,null,null,null,null,null,{"$f":"'1'!K4:L4","v":"Reg.nr.:"}]
[{"$f":"'1'!A5:B5","v":"Klubb:"},null,null,null,null,null,null,null,null,null,{"$f":"'1'!K5:L5","v":"Rase:"}]
[]
[null,"Klasse",null,"Liten",null,null,null,null,null,"Middels",null,null,"Stor"]
[]
[]
[{"$f":"'1'!A10","v":"Lydighet:"}]
[{"$f":"'1'!A11","v":"Øvelser:"},null,null,null,null,"Koeff.","Karakter","Karakter","Snitt","Poeng"]
[{"$f":"'1'!A12","v":1},{"$f":"'1'!B12","v":"Fri ved foten"},null,null,null,3,null,null,{"$f":"IF(G12=\"\",\"\",IF(H12=\"\",\"\",(G12+H12)/2))","v":""},{"$f":"IF(I12=\"\",\"\",IF(I12=0,\"I.G.\",I12*F12))","v":""}]
[{"$f":"'1'!A13","v":2},{"$f":"'1'!B13","v":"Innkalling m/stå og dekk"},null,null,null,3,null,null,{"$f":"IF(G13=\"\",\"\",IF(H13=\"\",\"\",(G13+H13)/2))","v":""},{"$f":"IF(I13=\"\",\"\",IF(I13=0,\"I.G.\",I13*F13))","v":""}]
[{"$f":"'1'!A14","v":3},{"$f":"'1'!B14","v":"Fremadsending"},null,null,null,3,null,null,"",""]
[{"$f":"'1'!A15","v":4},{"$f":"'1'!B15","v":"Kryp"},null,null,null,3,null,null,"",""]
[{"$f":"'1'!A16","v":5},{"$f":"'1'!B16","v":"Hals på kommando"},null,null,null,2,null,null,"",""]
[{"$f":"'1'!A17","v":6},{"$f":"'1'!B17","v":"Apportering metallapport"},null,null,null,3,null,null,"",""]
[{"$f":"'1'!A18","v":7},{"$f":"'1'!B18","v":"Apportering tung gjenstand"},null,null,null,3,null,null,"",""]
[{"$f":"'1'!A19","v":8},"Fritt hopp over hinder",null,null,null,2,null,null,"",""]
[{"$f":"'1'!A20","v":9},{"$f":"'1'!B20","v":"Stigeklatring"},null,null,null,2,null,null,"",""]
[{"$f":"'1'!A21","v":10},{"$f":"'1'!B21","v":"Fellesdekk"},null,null,null,2,null,null,"",""]
[{"$f":"'1'!A22","v":"Sum lydighet:"},null,null,null,null,{"$f":"SUM(F12:F21)","v":26},null,null,null,{"$f":"SUM(J12:J21)","v":0}]
[{"$f":"'1'!A23","v":"Sporgruppen:"}]
[{"$f":"'1'!A24","v":"Øvelser:"},null,null,null,null,"Koeff.","Karakter","Karakter","Snitt","Poeng"]
[{"$f":"'1'!A25","v":11},{"$f":"'1'!B25","v":"Feltsøk"},null,null,null,10,null,null,{"$f":"IF(G25=\"\",\"\",IF(H25=\"\",\"\",(G25+H25)/2))","v":""},{"$f":"IF(I25=\"\",\"\",IF(I25=0,\"I.G.\",I25*F25))","v":""}]
[{"$f":"'1'!A26","v":12},{"$f":"'1'!B26","v":"Sporoppsøk"},null,null,null,5,null,null,{"$f":"IF(G26=\"\",\"\",IF(H26=\"\",\"\",(G26+H26)/2))","v":""},{"$f":"IF(I26=\"\",\"\",IF(I26=0,\"I.G.\",I26*F26))","v":""}]
[{"$f":"'1'!A27","v":13},{"$f":"'1'!B27","v":"Spor"},null,null,null,24,null,null,"",""]
[{"$f":"'1'!A28","v":"Sum spesialøvelser:"},null,null,null,null,{"$f":"SUM(F25:F27)","v":39},null,null,null,{"$f":"IF(AND(J25=\"\",J26=\"\",J27=\"\"),\"\",SUM(J25:J27))","v":""}]
[{"$f":"'1'!A29","v":"Runderingsgruppen:"}]
[{"$f":"'1'!A30","v":"Øvelser:"},null,null,null,null,"Koeff.","Karakter","Karakter","Snitt","Poeng"]
[{"$f":"'1'!A31","v":11},{"$f":"'1'!B31","v":"Feltsøk"},null,null,null,10,null,null,{"$f":"IF(G31=\"\",\"\",IF(H31=\"\",\"\",(G31+H31)/2))","v":""},{"$f":"IF(I31=\"\",\"\",IF(I31=0,\"I.G.\",I31*F31))","v":""}]
[{"$f":"'1'!A32","v":12},{"$f":"'1'!B32","v":"Rundering"},null,null,null,{"$f":"'1'!F32","v":29},null,null,{"$f":"IF(G32=\"\",\"\",IF(H32=\"\",\"\",(G32+H32)/2))","v":""},{"$f":"IF(I32=\"\",\"\",IF(I32=0,\"I.G.\",I32*F32))","v":""}]
[{"$f":"'1'!A33","v":"Sum spesialøvelser:"},null,null,null,null,{"$f":"SUM(F31:F32)","v":39},null,null,null,{"$f":"IF(AND(J31=\"\",J32=\"\"),\"\",SUM(J31:J32))","v":""},null,"Godkjent",null,null,300,"poeng"]
[{"$f":"'1'!A34","v":"Rapportgruppen:"}]
[{"$f":"'1'!A35","v":"Start kl.:"},0,{"$f":"'1'!C35","v":"Ankomst kl.:"},0,{"$f":"'1'!E35:J35","v":"Anvendt tid:"},null,null,null,null,null,null,{"$f":"'1'!L35:N35","v":"Godkjent"},null,null,{"$f":"'1'!O35","v":325},{"$f":"'1'!P35","v":"poeng"}]
[{"$f":"'1'!A36","v":"B"},"00:00:00",{"$f":"'1'!C36","v":"A"},"00:00:00",{"$f":"SUM(B36,D36)","v":"00:00:00"},null,null,null,null,null,null,{"$f":"'1'!L36:N36","v":"- Derav i spesialøvelsene"},null,null,195,{"$f":"'1'!P36","v":"poeng"}]
[{"$f":"'1'!A37","v":"A"},"00:00:00",{"$f":"'1'!C37","v":"B"},"00:00:00",{"$f":"SUM(B37,D37)","v":"00:00:00"},null,null,null,null,null,null,"- Derav i lydighetsøvelsene",null,null,130,{"$f":"'1'!P37","v":"poeng"}]
[{"$f":"'1'!A38","v":"C"},"00:00:00",{"$f":"'1'!C38","v":"A"},"00:00:00",{"$f":"SUM(B38,D38)","v":"00:00:00"},null,null,null,null,null,null,{"$f":"'1'!L38:N38","v":"Cert/CACIT"},null,null,575,{"$f":"'1'!P38","v":"poeng"}]
[{"$f":"'1'!A39","v":"A"},"00:00:00",{"$f":"'1'!C39","v":"D"},"00:00:00",{"$f":"SUM(E35:J38)","v":"00:00:00"},null,null,null,null,null,null,{"$f":"'1'!L39:N39","v":"- Derav i spesialøvelsene"},null,null,312,{"$f":"'1'!P39","v":"poeng"}]
[{"$f":"'1'!A40","v":"Anvendt tid totalt:"},null,null,null,{"$f":"SUM(E36:J39)","v":"00:00:00"},null,null,null,null,null,null,{"$f":"'1'!L40:N40","v":"- Derav i lydighetsøvelsene"},null,null,208,{"$f":"'1'!P40","v":"poeng"}]
[{"$f":"'1'!A41","v":"Øvelser:"},null,null,null,null,{"$f":"'1'!F41","v":"Koeff."},{"$f":"'1'!G41","v":"Karakter"},{"$f":"'1'!H41","v":"Karakter"},"Snitt",{"$f":"'1'!J41","v":"Poeng"}]
[{"$f":"'1'!A42","v":11},{"$f":"'1'!B42","v":"Feltsøk"},null,null,null,10,null,null,{"$f":"IF(G42=\"\",\"\",IF(H42=\"\",\"\",(G42+H42)/2))","v":""},{"$f":"IF(I42=\"\",\"\",IF(I42=0,\"I.G.\",I42*F42))","v":""},null,null,null,null,{"$f":"'1'!O42:P42","v":"Poeng"}]
[{"$f":"'1'!A43","v":12},{"$f":"'1'!B43","v":"Rapport"},null,null,null,{"$f":"'1'!F43","v":29},null,null,{"$f":"IF(G43=\"\",\"\",IF(H43=\"\",\"\",(G43+H43)/2))","v":""},{"$f":"IF(I43=\"\",\"\",IF(I43=0,\"I.G.\",I43*F43))","v":""},null,{"$f":"'1'!L43:N43","v":"Sum Lydighet"},null,null,{"$f":"J22","v":0}]
[{"$f":"'1'!A44","v":"Sum spesialøvelser:"},null,null,null,null,{"$f":"SUM(F42:F43)","v":39},null,null,null,null,null,{"$f":"'1'!L44:N44","v":"Sum Spesialøvelser"},null,null,{"$f":"IF(Resultatskj!H4=\"Rundering\",J33,IF(Resultatskj!H4=\"Spor\",J28,IF(Resultatskj!H4=\"Rapport\",J44,\"\")))","v":""}]
[null,null,null,null,null,null,null,null,null,null,null,{"$f":"'1'!L45:N45","v":"Totalpoeng"},null,null,{"$f":"SUM(O43:P44)","v":0}]
[null,null,null,null,null,null,null,null,null,null,null,{"$f":"'1'!L46","v":"Ikke godkj."},{"$f":"'1'!M46","v":"Godkj."},null,{"$f":"'1'!O46","v":"Cert"},{"$f":"'1'!P46","v":"Plass"}]
[{"$f":"IF(Resultatskj!C3=\"\",\"\",Resultatskj!C3)","v":""},null,null,null,null,{"$f":"IF(Resultatskj!C4=\"\",\"\",Resultatskj!C4)","v":""},null,null,null,null,null,{"$f":"IF(OR(O45<O35,O44<O36,O43<O37,O45=\"\"),\"X\",\"\")","v":"X"},{"$f":"IF(AND(O45>=O35,O44>=O36,O43>=O37,L47=\"\"),\"X\",\"\")","v":""},null,{"$f":"IF(AND(O45>=575,O44>=311.99,O43>207.99,L47=\"\"),\"X\",\"\")","v":""},{"$f":"Resultatskj!A16","v":"-"}]
["Underskrift dommere",null,null,null,null,null,null,null,null,null,null,{"$f":"Resultatskj!K26","v":"B.Strand/A.Bakken 15.07.2015/19.06.2018"}]
[]
[{"$f":"IF(Resultatskj!$C$3=\"\",\"\",Resultatskj!$C$3)","v":""}]
[{"$f":"IF(Resultatskj!$C$4=\"\",\"\",Resultatskj!$C$4)","v":""}]

{"sheet":"10","index":11,"n_rows":51,"n_cols":16,"rows_kept":51,"cut":false,"hidden":false,"merged":[[50,0,50,9],[26,10,26,15],[25,10,25,15],[9,0,9,15],[14,1,14,4],[24,1,24,4],[25,1,25,4],[14,10,14,15],[16,10,16,15],[17,10,17,15],[20,1,20,4],[21,0,21,4],[10,10,10,15],[11,10,11,15],[12,10,12,15],[41,14,41,15],[3,0,3,1],[3,2,3,9],[3,10,3,11],[3,12,3,15],[4,0,4,1],[1,0,1,1],[0,2,0,4],[2,0,2,1],[2,2,2,9],[2,10,2,11],[38,11,38,13],[35,4,35,9],[36,4,36,9],[0,5,0,15],[1,10,1,12],[1,2,1,5],[2,12,2,15],[4,2,4,9],[4,10,4,11],[4,12,4,15],[23,0,23,4],[23,10,23,15],[24,10,24,15],[41,1,41,4],[34,4,34,9],[40,0,40,4],[41,11,41,13],[34,2,34,3],[39,11,39,13],[39,0,39,3],[39,4,39,9],[35,11,35,13],[37,11,37,13],[36,11,36,13],[38,4,38,9],[37,4,37,9],[10,0,10,4],[13,10,13,15],[11,1,11,4],[12,1,12,4],[13,1,13,4],[18,10,18,15],[18,1,18,4],[33,0,33,15],[15,1,15,4],[15,10,15,15],[16,1,16,4],[17,1,17,4],[22,0,22,15],[29,0,29,4],[31,1,31,4],[19,1,19,4],[19,10,19,15],[20,10,20,15],[21,10,21,15],[30,1,30,4],[28,0,28,15],[34,0,34,1],[34,11,34,13],[26,1,26,4],[32,0,32,4],[27,0,27,4],[27,10,27,15],[32,10,32,15],[31,10,31,15],[30,10,30,15],[29,10,29,15],[42,1,42,4],[43,0,43,4],[44,11,44,13],[42,11,42,13],[44,14,44,15],[43,14,43,15],[43,11,43,13],[42,14,42,15],[44,0,46,9],[49,11,49,15],[47,11,47,15],[45,12,45,13],[46,12,46,13],[47,0,47,9],[49,0,49,9]]}
[null,null,null,null,null,{"$f":"'1'!F1:R1","v":"Kl. A - DOMMERPROTOKOLL"}]
[{"$f":"'1'!A2:B2","v":"Dato:"},null,{"$f":"IF(Resultatskj!L2=\"\",\"\",Resultatskj!L2)","v":""},null,null,null,null,null,null,{"$f":"'1'!J2","v":"Gruppe:"},{"$f":"IF(Resultatskj!H4=\"\",\"\",Resultatskj!H4)","v":"Spor"},null,null,null,"Katalog nr.",{"$f":"Resultatskj!B17","v":""}]
[{"$f":"'1'!A3:B3","v":"Arrangør:"},null,{"$f":"IF(Resultatskj!$C$2=\"\",\"\",Resultatskj!$C$2)","v":"Norsk Brukshundsports Forbund"},null,null,null,null,null,null,null,{"$f":"'1'!K3:L3","v":"Hundens navn:"}]
[{"$f":"'1'!A4:B4","v":"Fører:"},null,null,null,null,null,null,null,null,null,{"$f":"'1'!K4:L4","v":"Reg.nr.:"}]
[{"$f":"'1'!A5:B5","v":"Klubb:"},null,null,null,null,null,null,null,null,null,{"$f":"'1'!K5:L5","v":"Rase:"}]
[]
[null,"Klasse",null,"Liten",null,null,null,null,null,"Middels",null,null,"Stor"]
[]
[]
[{"$f":"'1'!A10","v":"Lydighet:"}]
[{"$f":"'1'!A11","v":"Øvelser:"},null,null,null,null,"Koeff.","Karakter","Karakter","Snitt","Poeng"]
[{"$f":"'1'!A12","v":1},{"$f":"'1'!B12","v":"Fri ved foten"},null,null,null,3,null,null,{"$f":"IF(G12=\"\",\"\",IF(H12=\"\",\"\",(G12+H12)/2))","v":""},{"$f":"IF(I12=\"\",\"\",IF(I12=0,\"I.G.\",I12*F12))","v":""}]
[{"$f":"'1'!A13","v":2},{"$f":"'1'!B13","v":"Innkalling m/stå og dekk"},null,null,null,3,null,null,{"$f":"IF(G13=\"\",\"\",IF(H13=\"\",\"\",(G13+H13)/2))","v":""},{"$f":"IF(I13=\"\",\"\",IF(I13=0,\"I.G.\",I13*F13))","v":""}]
[{"$f":"'1'!A14","v":3},{"$f":"'1'!B14","v":"Fremadsending"},null,null,null,3,null,null,"",""]
[{"$f":"'1'!A15","v":4},{"$f":"'1'!B15","v":"Kryp"},null,null,null,3,null,null,"",""]
[{"$f":"'1'!A16","v":5},{"$f":"'1'!B16","v":"Hals på kommando"},null,null,null,2,null,null,"",""]
[{"$f":"'1'!A17","v":6},{"$f":"'1'!B17","v":"Apportering metallapport"},null,null,null,3,null,null,"",""]
[{"$f":"'1'!A18","v":7},{"$f":"'1'!B18","v":"Apportering tung gjenstand"},null,null,null,3,null,null,"",""]
[{"$f":"'1'!A19","v":8},"Fritt hopp over hinder",null,null,null,2,null,null,"",""]
[{"$f":"'1'!A20","v":9},{"$f":"'1'!B20","v":"Stigeklatring"},null,null,null,2,null,null,"",""]
[{"$f":"'1'!A21","v":10},{"$f":"'1'!B21","v":"Fellesdekk"},null,null,null,2,null,null,"",""]
[{"$f":"'1'!A22","v":"Sum lydighet:"},null,null,null,null,{"$f":"SUM(F12:F21)","v":26},null,null,null,{"$f":"SUM(J12:J21)","v":0}]
[{"$f":"'1'!A23","v":"Sporgruppen:"}]
[{"$f":"'1'!A24","v":"Øvelser:"},null,null,null,null,"Koeff.","Karakter","Karakter","Snitt","Poeng"]
[{"$f":"'1'!A25","v":11},{"$f":"'1'!B25","v":"Feltsøk"},null,null,null,10,null,null,{"$f":"IF(G25=\"\",\"\",IF(H25=\"\",\"\",(G25+H25)/2))","v":""},{"$f":"IF(I25=\"\",\"\",IF(I25=0,\"I.G.\",I25*F25))","v":""}]
[{"$f":"'1'!A26","v":12},{"$f":"'1'!B26","v":"Sporoppsøk"},null,null,null,5,null,null,{"$f":"IF(G26=\"\",\"\",IF(H26=\"\",\"\",(G26+H26)/2))","v":""},{"$f":"IF(I26=\"\",\"\",IF(I26=0,\"I.G.\",I26*F26))","v":""}]
[{"$f":"'1'!A27","v":13},{"$f":"'1'!B27","v":"Spor"},null,null,null,24,null,null,"",""]
[{"$f":"'1'!A28","v":"Sum spesialøvelser:"},null,null,null,null,{"$f":"SUM(F25:F27)","v":39},null,null,null,{"$f":"IF(AND(J25=\"\",J26=\"\",J27=\"\"),\"\",SUM(J25:J27))","v":""}]
[{"$f":"'1'!A29","v":"Runderingsgruppen:"}]
[{"$f":"'1'!A30","v":"Øvelser:"},null,null,null,null,"Koeff.","Karakter","Karakter","Snitt","Poeng"]
[{"$f":"'1'!A31","v":11},{"$f":"'1'!B31","v":"Feltsøk"},null,null,null,10,null,null,{"$f":"IF(G31=\"\",\"\",IF(H31=\"\",\"\",(G31+H31)/2))","v":""},{"$f":"IF(I31=\"\",\"\",IF(I31=0,\"I.G.\",I31*F31))","v":""}]
[{"$f":"'1'!A32","v":12},{"$f":"'1'!B32","v":"Rundering"},null,null,null,{"$f":"'1'!F32","v":29},null,null,{"$f":"IF(G32=\"\",\"\",IF(H32=\"\",\"\",(G32+H32)/2))","v":""},{"$f":"IF(I32=\"\",\"\",IF(I32=0,\"I.G.\",I32*F32))","v":""}]
[{"$f":"'1'!A33","v":"Sum spesialøvelser:"},null,null,null,null,{"$f":"SUM(F31:F32)","v":39},null,null,null,{"$f":"IF(AND(J31=\"\",J32=\"\"),\"\",SUM(J31:J32))","v":""},null,"Godkjent",null,null,300,"poeng"]
[{"$f":"'1'!A34","v":"Rapportgruppen:"}]
[{"$f":"'1'!A35","v":"Start kl.:"},0,{"$f":"'1'!C35","v":"Ankomst kl.:"},0,{"$f":"'1'!E35:J35","v":"Anvendt tid:"},null,null,null,null,null,null,{"$f":"'1'!L35:N35","v":"Godkjent"},null,null,{"$f":"'1'!O35","v":325},{"$f":"'1'!P35","v":"poeng"}]
[{"$f":"'1'!A36","v":"B"},"00:00:00",{"$f":"'1'!C36","v":"A"},"00:00:00",{"$f":"SUM(B36,D36)","v":"00:00:00"},null,null,null,null,null,null,{"$f":"'1'!L36:N36","v":"- Derav i spesialøvelsene"},null,null,195,{"$f":"'1'!P36","v":"poeng"}]
[{"$f":"'1'!A37","v":"A"},"00:00:00",{"$f":"'1'!C37","v":"B"},"00:00:00",{"$f":"SUM(B37,D37)","v":"00:00:00"},null,null,null,null,null,null,"- Derav i lydighetsøvelsene",null,null,130,{"$f":"'1'!P37","v":"poeng"}]
[{"$f":"'1'!A38","v":"C"},"00:00:00",{"$f":"'1'!C38","v":"A"},"00:00:00",{"$f":"SUM(B38,D38)","v":"00:00:00"},null,null,null,null,null,null,{"$f":"'1'!L38:N38","v":"Cert/CACIT"},null,null,575,{"$f":"'1'!P38","v":"poeng"}]
[{"$f":"'1'!A39","v":"A"},"00:00:00",{"$f":"'1'!C39","v":"D"},"00:00:00",{"$f":"SUM(E35:J38)","v":"00:00:00"},null,null,null,null,null,null,{"$f":"'1'!L39:N39","v":"- Derav i spesialøvelsene"},null,null,312,{"$f":"'1'!P39","v":"poeng"}]
[{"$f":"'1'!A40","v":"Anvendt tid totalt:"},null,null,null,{"$f":"SUM(E36:J39)","v":"00:00:00"},null,null,null,null,null,null,{"$f":"'1'!L40:N40","v":"- Derav i lydighetsøvelsene"},null,null,208,{"$f":"'1'!P40","v":"poeng"}]
[{"$f":"'1'!A41","v":"Øvelser:"},null,null,null,null,{"$f":"'1'!F41","v":"Koeff."},{"$f":"'1'!G41","v":"Karakter"},{"$f":"'1'!H41","v":"Karakter"},"Snitt",{"$f":"'1'!J41","v":"Poeng"}]
[{"$f":"'1'!A42","v":11},{"$f":"'1'!B42","v":"Feltsøk"},null,null,null,10,null,null,{"$f":"IF(G42=\"\",\"\",IF(H42=\"\",\"\",(G42+H42)/2))","v":""},{"$f":"IF(I42=\"\",\"\",IF(I42=0,\"I.G.\",I42*F42))","v":""},null,null,null,null,{"$f":"'1'!O42:P42","v":"Poeng"}]
[{"$f":"'1'!A43","v":12},{"$f":"'1'!B43","v":"Rapport"},null,null,null,{"$f":"'1'!F43","v":29},null,null,{"$f":"IF(G43=\"\",\"\",IF(H43=\"\",\"\",(G43+H43)/2))","v":""},{"$f":"IF(I43=\"\",\"\",IF(I43=0,\"I.G.\",I43*F43))","v":""},null,{"$f":"'1'!L43:N43","v":"Sum Lydighet"},null,null,{"$f":"J22","v":0}]
[{"$f":"'1'!A44","v":"Sum spesialøvelser:"},null,null,null,null,{"$f":"SUM(F42:F43)","v":39},null,null,null,null,null,{"$f":"'1'!L44:N44","v":"Sum Spesialøvelser"},null,null,{"$f":"IF(Resultatskj!H4=\"Rundering\",J33,IF(Resultatskj!H4=\"Spor\",J28,IF(Resultatskj!H4=\"Rapport\",J44,\"\")))","v":""}]
[null,null,null,null,null,null,null,null,null,null,null,{"$f":"'1'!L45:N45","v":"Totalpoeng"},null,null,{"$f":"SUM(O43:P44)","v":0}]
[null,null,null,null,null,null,null,null,null,null,null,{"$f":"'1'!L46","v":"Ikke godkj."},{"$f":"'1'!M46","v":"Godkj."},null,{"$f":"'1'!O46","v":"Cert"},{"$f":"'1'!P46","v":"Plass"}]
[{"$f":"IF(Resultatskj!C3=\"\",\"\",Resultatskj!C3)","v":""},null,null,null,null,{"$f":"IF(Resultatskj!C4=\"\",\"\",Resultatskj!C4)","v":""},null,null,null,null,null,{"$f":"IF(OR(O45<O35,O44<O36,O43<O37,O45=\"\"),\"X\",\"\")","v":"X"},{"$f":"IF(AND(O45>=O35,O44>=O36,O43>=O37,L47=\"\"),\"X\",\"\")","v":""},null,{"$f":"IF(AND(O45>=575,O44>=311.99,O43>207.99,L47=\"\"),\"X\",\"\")","v":""},{"$f":"Resultatskj!A17","v":"-"}]
["Underskrift dommere",null,null,null,null,null,null,null,null,null,null,{"$f":"Resultatskj!K26","v":"B.Strand/A.Bakken 15.07.2015/19.06.2018"}]
[]
[{"$f":"IF(Resultatskj!$C$3=\"\",\"\",Resultatskj!$C$3)","v":""}]
[{"$f":"IF(Resultatskj!$C$4=\"\",\"\",Resultatskj!$C$4)","v":""}]

{"sheet":"11","index":12,"n_rows":51,"n_cols":16,"rows_kept":51,"cut":false,"hidden":false,"merged":[[50,0,50,9],[16,10,16,15],[18,1,18,4],[15,10,15,15],[17,10,17,15],[30,1,30,4],[23,10,23,15],[24,10,24,15],[30,10,30,15],[25,10,25,15],[29,10,29,15],[18,10,18,15],[20,10,20,15],[21,10,21,15],[22,0,22,15],[19,10,19,15],[0,5,0,15],[26,10,26,15],[43,11,43,13],[2,2,2,9],[36,4,36,9],[38,11,38,13],[37,11,37,13],[37,4,37,9],[31,10,31,15],[2,12,2,15],[14,10,14,15],[9,0,9,15],[14,1,14,4],[2,0,2,1],[2,10,2,11],[15,1,15,4],[1,0,1,1],[1,2,1,5],[1,10,1,12],[3,10,3,11],[3,0,3,1],[3,2,3,9],[3,12,3,15],[4,0,4,1],[4,2,4,9],[4,10,4,11],[4,12,4,15],[13,1,13,4],[13,10,13,15],[12,10,12,15],[10,0,10,4],[10,10,10,15],[11,1,11,4],[11,10,11,15],[33,0,33,15],[34,0,34,1],[34,2,34,3],[39,0,39,3],[39,4,39,9],[35,11,35,13],[35,4,35,9],[38,4,38,9],[32,10,32,15],[27,10,27,15],[28,0,28,15],[29,0,29,4],[31,1,31,4],[32,0,32,4],[23,0,23,4],[26,1,26,4],[27,0,27,4],[16,1,16,4],[17,1,17,4],[24,1,24,4],[25,1,25,4],[20,1,20,4],[21,0,21,4],[19,1,19,4],[0,2,0,4],[42,14,42,15],[42,11,42,13],[45,12,45,13],[46,12,46,13],[34,4,34,9],[34,11,34,13],[44,0,46,9],[44,11,44,13],[44,14,44,15],[43,14,43,15],[40,0,40,4],[41,11,41,13],[41,14,41,15],[41,1,41,4],[12,1,12,4],[49,11,49,15],[47,11,47,15],[36,11,36,13],[42,1,42,4],[43,0,43,4],[47,0,47,9],[39,11,39,13],[49,0,49,9]]}
[null,null,null,null,null,{"$f":"'1'!F1:R1","v":"Kl. A - DOMMERPROTOKOLL"}]
[{"$f":"'1'!A2:B2","v":"Dato:"},null,{"$f":"IF(Resultatskj!L2=\"\",\"\",Resultatskj!L2)","v":""},null,null,null,null,null,null,{"$f":"'1'!J2","v":"Gruppe:"},{"$f":"IF(Resultatskj!H4=\"\",\"\",Resultatskj!H4)","v":"Spor"},null,null,null,"Katalog nr.",{"$f":"Resultatskj!B18","v":""}]
[{"$f":"'1'!A3:B3","v":"Arrangør:"},null,{"$f":"IF(Resultatskj!$C$2=\"\",\"\",Resultatskj!$C$2)","v":"Norsk Brukshundsports Forbund"},null,null,null,null,null,null,null,{"$f":"'1'!K3:L3","v":"Hundens navn:"}]
[{"$f":"'1'!A4:B4","v":"Fører:"},null,null,null,null,null,null,null,null,null,{"$f":"'1'!K4:L4","v":"Reg.nr.:"}]
[{"$f":"'1'!A5:B5","v":"Klubb:"},null,null,null,null,null,null,null,null,null,{"$f":"'1'!K5:L5","v":"Rase:"}]
[]
[null,"Klasse",null,"Liten",null,null,null,null,null,"Middels",null,null,"Stor"]
[]
[]
[{"$f":"'1'!A10","v":"Lydighet:"}]
[{"$f":"'1'!A11","v":"Øvelser:"},null,null,null,null,"Koeff.","Karakter","Karakter","Snitt","Poeng"]
[{"$f":"'1'!A12","v":1},{"$f":"'1'!B12","v":"Fri ved foten"},null,null,null,3,null,null,{"$f":"IF(G12=\"\",\"\",IF(H12=\"\",\"\",(G12+H12)/2))","v":""},{"$f":"IF(I12=\"\",\"\",IF(I12=0,\"I.G.\",I12*F12))","v":""}]
[{"$f":"'1'!A13","v":2},{"$f":"'1'!B13","v":"Innkalling m/stå og dekk"},null,null,null,3,null,null,{"$f":"IF(G13=\"\",\"\",IF(H13=\"\",\"\",(G13+H13)/2))","v":""},{"$f":"IF(I13=\"\",\"\",IF(I13=0,\"I.G.\",I13*F13))","v":""}]
[{"$f":"'1'!A14","v":3},{"$f":"'1'!B14","v":"Fremadsending"},null,null,null,3,null,null,"",""]
[{"$f":"'1'!A15","v":4},{"$f":"'1'!B15","v":"Kryp"},null,null,null,3,null,null,"",""]
[{"$f":"'1'!A16","v":5},{"$f":"'1'!B16","v":"Hals på kommando"},null,null,null,2,null,null,"",""]
[{"$f":"'1'!A17","v":6},{"$f":"'1'!B17","v":"Apportering metallapport"},null,null,null,3,null,null,"",""]
[{"$f":"'1'!A18","v":7},{"$f":"'1'!B18","v":"Apportering tung gjenstand"},null,null,null,3,null,null,"",""]
[{"$f":"'1'!A19","v":8},"Fritt hopp over hinder",null,null,null,2,null,null,"",""]
[{"$f":"'1'!A20","v":9},{"$f":"'1'!B20","v":"Stigeklatring"},null,null,null,2,null,null,"",""]
[{"$f":"'1'!A21","v":10},{"$f":"'1'!B21","v":"Fellesdekk"},null,null,null,2,null,null,"",""]
[{"$f":"'1'!A22","v":"Sum lydighet:"},null,null,null,null,{"$f":"SUM(F12:F21)","v":26},null,null,null,{"$f":"SUM(J12:J21)","v":0}]
[{"$f":"'1'!A23","v":"Sporgruppen:"}]
[{"$f":"'1'!A24","v":"Øvelser:"},null,null,null,null,"Koeff.","Karakter","Karakter","Snitt","Poeng"]
[{"$f":"'1'!A25","v":11},{"$f":"'1'!B25","v":"Feltsøk"},null,null,null,10,null,null,{"$f":"IF(G25=\"\",\"\",IF(H25=\"\",\"\",(G25+H25)/2))","v":""},{"$f":"IF(I25=\"\",\"\",IF(I25=0,\"I.G.\",I25*F25))","v":""}]
[{"$f":"'1'!A26","v":12},{"$f":"'1'!B26","v":"Sporoppsøk"},null,null,null,5,null,null,{"$f":"IF(G26=\"\",\"\",IF(H26=\"\",\"\",(G26+H26)/2))","v":""},{"$f":"IF(I26=\"\",\"\",IF(I26=0,\"I.G.\",I26*F26))","v":""}]
[{"$f":"'1'!A27","v":13},{"$f":"'1'!B27","v":"Spor"},null,null,null,24,null,null,"",""]
[{"$f":"'1'!A28","v":"Sum spesialøvelser:"},null,null,null,null,{"$f":"SUM(F25:F27)","v":39},null,null,null,{"$f":"IF(AND(J25=\"\",J26=\"\",J27=\"\"),\"\",SUM(J25:J27))","v":""}]
[{"$f":"'1'!A29","v":"Runderingsgruppen:"}]
[{"$f":"'1'!A30","v":"Øvelser:"},null,null,null,null,"Koeff.","Karakter","Karakter","Snitt","Poeng"]
[{"$f":"'1'!A31","v":11},{"$f":"'1'!B31","v":"Feltsøk"},null,null,null,10,null,null,{"$f":"IF(G31=\"\",\"\",IF(H31=\"\",\"\",(G31+H31)/2))","v":""},{"$f":"IF(I31=\"\",\"\",IF(I31=0,\"I.G.\",I31*F31))","v":""}]
[{"$f":"'1'!A32","v":12},{"$f":"'1'!B32","v":"Rundering"},null,null,null,{"$f":"'1'!F32","v":29},null,null,{"$f":"IF(G32=\"\",\"\",IF(H32=\"\",\"\",(G32+H32)/2))","v":""},{"$f":"IF(I32=\"\",\"\",IF(I32=0,\"I.G.\",I32*F32))","v":""}]
[{"$f":"'1'!A33","v":"Sum spesialøvelser:"},null,null,null,null,{"$f":"SUM(F31:F32)","v":39},null,null,null,{"$f":"IF(AND(J31=\"\",J32=\"\"),\"\",SUM(J31:J32))","v":""},null,"Godkjent",null,null,300,"poeng"]
[{"$f":"'1'!A34","v":"Rapportgruppen:"}]
[{"$f":"'1'!A35","v":"Start kl.:"},0,{"$f":"'1'!C35","v":"Ankomst kl.:"},0,{"$f":"'1'!E35:J35","v":"Anvendt tid:"},null,null,null,null,null,null,{"$f":"'1'!L35:N35","v":"Godkjent"},null,null,{"$f":"'1'!O35","v":325},{"$f":"'1'!P35","v":"poeng"}]
[{"$f":"'1'!A36","v":"B"},"00:00:00",{"$f":"'1'!C36","v":"A"},"00:00:00",{"$f":"SUM(B36,D36)","v":"00:00:00"},null,null,null,null,null,null,{"$f":"'1'!L36:N36","v":"- Derav i spesialøvelsene"},null,null,195,{"$f":"'1'!P36","v":"poeng"}]
[{"$f":"'1'!A37","v":"A"},"00:00:00",{"$f":"'1'!C37","v":"B"},"00:00:00",{"$f":"SUM(B37,D37)","v":"00:00:00"},null,null,null,null,null,null,"- Derav i lydighetsøvelsene",null,null,130,{"$f":"'1'!P37","v":"poeng"}]
[{"$f":"'1'!A38","v":"C"},"00:00:00",{"$f":"'1'!C38","v":"A"},"00:00:00",{"$f":"SUM(B38,D38)","v":"00:00:00"},null,null,null,null,null,null,{"$f":"'1'!L38:N38","v":"Cert/CACIT"},null,null,575,{"$f":"'1'!P38","v":"poeng"}]
[{"$f":"'1'!A39","v":"A"},"00:00:00",{"$f":"'1'!C39","v":"D"},"00:00:00",{"$f":"SUM(E35:J38)","v":"00:00:00"},null,null,null,null,null,null,{"$f":"'1'!L39:N39","v":"- Derav i spesialøvelsene"},null,null,312,{"$f":"'1'!P39","v":"poeng"}]
[{"$f":"'1'!A40","v":"Anvendt tid totalt:"},null,null,null,{"$f":"SUM(E36:J39)","v":"00:00:00"},null,null,null,null,null,null,{"$f":"'1'!L40:N40","v":"- Derav i lydighetsøvelsene"},null,null,208,{"$f":"'1'!P40","v":"poeng"}]
[{"$f":"'1'!A41","v":"Øvelser:"},null,null,null,null,{"$f":"'1'!F41","v":"Koeff."},{"$f":"'1'!G41","v":"Karakter"},{"$f":"'1'!H41","v":"Karakter"},"Snitt",{"$f":"'1'!J41","v":"Poeng"}]
[{"$f":"'1'!A42","v":11},{"$f":"'1'!B42","v":"Feltsøk"},null,null,null,10,null,null,{"$f":"IF(G42=\"\",\"\",IF(H42=\"\",\"\",(G42+H42)/2))","v":""},{"$f":"IF(I42=\"\",\"\",IF(I42=0,\"I.G.\",I42*F42))","v":""},null,null,null,null,{"$f":"'1'!O42:P42","v":"Poeng"}]
[{"$f":"'1'!A43","v":12},{"$f":"'1'!B43","v":"Rapport"},null,null,null,{"$f":"'1'!F43","v":29},null,null,{"$f":"IF(G43=\"\",\"\",IF(H43=\"\",\"\",(G43+H43)/2))","v":""},{"$f":"IF(I43=\"\",\"\",IF(I43=0,\"I.G.\",I43*F43))","v":""},null,{"$f":"'1'!L43:N43","v":"Sum Lydighet"},null,null,{"$f":"J22","v":0}]
[{"$f":"'1'!A44","v":"Sum spesialøvelser:"},null,null,null,null,{"$f":"SUM(F42:F43)","v":39},null,null,null,null,null,{"$f":"'1'!L44:N44","v":"Sum Spesialøvelser"},null,null,{"$f":"IF(Resultatskj!H4=\"Rundering\",J33,IF(Resultatskj!H4=\"Spor\",J28,IF(Resultatskj!H4=\"Rapport\",J44,\"\")))","v":""}]
[null,null,null,null,null,null,null,null,null,null,null,{"$f":"'1'!L45:N45","v":"Totalpoeng"},null,null,{"$f":"SUM(O43:P44)","v":0}]
[null,null,null,null,null,null,null,null,null,null,null,{"$f":"'1'!L46","v":"Ikke godkj."},{"$f":"'1'!M46","v":"Godkj."},null,{"$f":"'1'!O46","v":"Cert"},{"$f":"'1'!P46","v":"Plass"}]
[{"$f":"IF(Resultatskj!C3=\"\",\"\",Resultatskj!C3)","v":""},null,null,null,null,{"$f":"IF(Resultatskj!C4=\"\",\"\",Resultatskj!C4)","v":""},null,null,null,null,null,{"$f":"IF(OR(O45<O35,O44<O36,O43<O37,O45=\"\"),\"X\",\"\")","v":"X"},{"$f":"IF(AND(O45>=O35,O44>=O36,O43>=O37,L47=\"\"),\"X\",\"\")","v":""},null,{"$f":"IF(AND(O45>=575,O44>=311.99,O43>207.99,L47=\"\"),\"X\",\"\")","v":""},{"$f":"Resultatskj!A18","v":"-"}]
["Underskrift dommere",null,null,null,null,null,null,null,null,null,null,{"$f":"Resultatskj!K26","v":"B.Strand/A.Bakken 15.07.2015/19.06.2018"}]
[]
[{"$f":"IF(Resultatskj!$C$3=\"\",\"\",Resultatskj!$C$3)","v":""}]
[{"$f":"IF(Resultatskj!$C$4=\"\",\"\",Resultatskj!$C$4)","v":""}]

{"sheet":"12","index":13,"n_rows":51,"n_cols":16,"rows_kept":51,"cut":false,"hidden":false,"merged":[[50,0,50,9],[26,10,26,15],[25,10,25,15],[9,0,9,15],[14,1,14,4],[24,1,24,4],[25,1,25,4],[14,10,14,15],[16,10,16,15],[17,10,17,15],[20,1,20,4],[21,0,21,4],[10,10,10,15],[11,10,11,15],[12,10,12,15],[41,14,41,15],[3,0,3,1],[3,2,3,9],[3,10,3,11],[3,12,3,15],[4,0,4,1],[1,0,1,1],[0,2,0,4],[2,0,2,1],[2,2,2,9],[2,10,2,11],[38,11,38,13],[35,4,35,9],[36,4,36,9],[0,5,0,15],[1,10,1,12],[1,2,1,5],[2,12,2,15],[4,2,4,9],[4,10,4,11],[4,12,4,15],[23,0,23,4],[23,10,23,15],[24,10,24,15],[41,1,41,4],[34,4,34,9],[40,0,40,4],[41,11,41,13],[34,2,34,3],[39,11,39,13],[39,0,39,3],[39,4,39,9],[35,11,35,13],[37,11,37,13],[36,11,36,13],[38,4,38,9],[37,4,37,9],[10,0,10,4],[13,10,13,15],[11,1,11,4],[12,1,12,4],[13,1,13,4],[18,10,18,15],[18,1,18,4],[33,0,33,15],[15,1,15,4],[15,10,15,15],[16,1,16,4],[17,1,17,4],[22,0,22,15],[29,0,29,4],[31,1,31,4],[19,1,19,4],[19,10,19,15],[20,10,20,15],[21,10,21,15],[30,1,30,4],[28,0,28,15],[34,0,34,1],[34,11,34,13],[26,1,26,4],[32,0,32,4],[27,0,27,4],[27,10,27,15],[32,10,32,15],[31,10,31,15],[30,10,30,15],[29,10,29,15],[42,1,42,4],[43,0,43,4],[44,11,44,13],[42,11,42,13],[44,14,44,15],[43,14,43,15],[43,11,43,13],[42,14,42,15],[44,0,46,9],[49,11,49,15],[47,11,47,15],[45,12,45,13],[46,12,46,13],[47,0,47,9],[49,0,49,9]]}
[null,null,null,null,null,{"$f":"'1'!F1:R1","v":"Kl. A - DOMMERPROTOKOLL"}]
[{"$f":"'1'!A2:B2","v":"Dato:"},null,{"$f":"IF(Resultatskj!L2=\"\",\"\",Resultatskj!L2)","v":""},null,null,null,null,null,null,{"$f":"'1'!J2","v":"Gruppe:"},{"$f":"IF(Resultatskj!H4=\"\",\"\",Resultatskj!H4)","v":"Spor"},null,null,null,"Katalog nr.",{"$f":"Resultatskj!B19","v":""}]
[{"$f":"'1'!A3:B3","v":"Arrangør:"},null,{"$f":"IF(Resultatskj!$C$2=\"\",\"\",Resultatskj!$C$2)","v":"Norsk Brukshundsports Forbund"},null,null,null,null,null,null,null,{"$f":"'1'!K3:L3","v":"Hundens navn:"}]
[{"$f":"'1'!A4:B4","v":"Fører:"},null,null,null,null,null,null,null,null,null,{"$f":"'1'!K4:L4","v":"Reg.nr.:"}]
[{"$f":"'1'!A5:B5","v":"Klubb:"},null,null,null,null,null,null,null,null,null,{"$f":"'1'!K5:L5","v":"Rase:"}]
[]
[null,"Klasse",null,"Liten",null,null,null,null,null,"Middels",null,null,"Stor"]
[]
[]
[{"$f":"'1'!A10","v":"Lydighet:"}]
[{"$f":"'1'!A11","v":"Øvelser:"},null,null,null,null,"Koeff.","Karakter","Karakter","Snitt","Poeng"]
[{"$f":"'1'!A12","v":1},{"$f":"'1'!B12","v":"Fri ved foten"},null,null,null,3,null,null,{"$f":"IF(G12=\"\",\"\",IF(H12=\"\",\"\",(G12+H12)/2))","v":""},{"$f":"IF(I12=\"\",\"\",IF(I12=0,\"I.G.\",I12*F12))","v":""}]
[{"$f":"'1'!A13","v":2},{"$f":"'1'!B13","v":"Innkalling m/stå og dekk"},null,null,null,3,null,null,{"$f":"IF(G13=\"\",\"\",IF(H13=\"\",\"\",(G13+H13)/2))","v":""},{"$f":"IF(I13=\"\",\"\",IF(I13=0,\"I.G.\",I13*F13))","v":""}]
[{"$f":"'1'!A14","v":3},{"$f":"'1'!B14","v":"Fremadsending"},null,null,null,3,null,null,"",""]
[{"$f":"'1'!A15","v":4},{"$f":"'1'!B15","v":"Kryp"},null,null,null,3,null,null,"",""]
[{"$f":"'1'!A16","v":5},{"$f":"'1'!B16","v":"Hals på kommando"},null,null,null,2,null,null,"",""]
[{"$f":"'1'!A17","v":6},{"$f":"'1'!B17","v":"Apportering metallapport"},null,null,null,3,null,null,"",""]
[{"$f":"'1'!A18","v":7},{"$f":"'1'!B18","v":"Apportering tung gjenstand"},null,null,null,3,null,null,"",""]
[{"$f":"'1'!A19","v":8},"Fritt hopp over hinder",null,null,null,2,null,null,"",""]
[{"$f":"'1'!A20","v":9},{"$f":"'1'!B20","v":"Stigeklatring"},null,null,null,2,null,null,"",""]
[{"$f":"'1'!A21","v":10},{"$f":"'1'!B21","v":"Fellesdekk"},null,null,null,2,null,null,"",""]
[{"$f":"'1'!A22","v":"Sum lydighet:"},null,null,null,null,{"$f":"SUM(F12:F21)","v":26},null,null,null,{"$f":"SUM(J12:J21)","v":0}]
[{"$f":"'1'!A23","v":"Sporgruppen:"}]
[{"$f":"'1'!A24","v":"Øvelser:"},null,null,null,null,"Koeff.","Karakter","Karakter","Snitt","Poeng"]
[{"$f":"'1'!A25","v":11},{"$f":"'1'!B25","v":"Feltsøk"},null,null,null,10,null,null,{"$f":"IF(G25=\"\",\"\",IF(H25=\"\",\"\",(G25+H25)/2))","v":""},{"$f":"IF(I25=\"\",\"\",IF(I25=0,\"I.G.\",I25*F25))","v":""}]
[{"$f":"'1'!A26","v":12},{"$f":"'1'!B26","v":"Sporoppsøk"},null,null,null,5,null,null,{"$f":"IF(G26=\"\",\"\",IF(H26=\"\",\"\",(G26+H26)/2))","v":""},{"$f":"IF(I26=\"\",\"\",IF(I26=0,\"I.G.\",I26*F26))","v":""}]
[{"$f":"'1'!A27","v":13},{"$f":"'1'!B27","v":"Spor"},null,null,null,24,null,null,"",""]
[{"$f":"'1'!A28","v":"Sum spesialøvelser:"},null,null,null,null,{"$f":"SUM(F25:F27)","v":39},null,null,null,{"$f":"IF(AND(J25=\"\",J26=\"\",J27=\"\"),\"\",SUM(J25:J27))","v":""}]
[{"$f":"'1'!A29","v":"Runderingsgruppen:"}]
[{"$f":"'1'!A30","v":"Øvelser:"},null,null,null,null,"Koeff.","Karakter","Karakter","Snitt","Poeng"]
[{"$f":"'1'!A31","v":11},{"$f":"'1'!B31","v":"Feltsøk"},null,null,null,10,null,null,{"$f":"IF(G31=\"\",\"\",IF(H31=\"\",\"\",(G31+H31)/2))","v":""},{"$f":"IF(I31=\"\",\"\",IF(I31=0,\"I.G.\",I31*F31))","v":""}]
[{"$f":"'1'!A32","v":12},{"$f":"'1'!B32","v":"Rundering"},null,null,null,{"$f":"'1'!F32","v":29},null,null,{"$f":"IF(G32=\"\",\"\",IF(H32=\"\",\"\",(G32+H32)/2))","v":""},{"$f":"IF(I32=\"\",\"\",IF(I32=0,\"I.G.\",I32*F32))","v":""}]
[{"$f":"'1'!A33","v":"Sum spesialøvelser:"},null,null,null,null,{"$f":"SUM(F31:F32)","v":39},null,null,null,{"$f":"IF(AND(J31=\"\",J32=\"\"),\"\",SUM(J31:J32))","v":""},null,"Godkjent",null,null,300,"poeng"]
[{"$f":"'1'!A34","v":"Rapportgruppen:"}]
[{"$f":"'1'!A35","v":"Start kl.:"},0,{"$f":"'1'!C35","v":"Ankomst kl.:"},0,{"$f":"'1'!E35:J35","v":"Anvendt tid:"},null,null,null,null,null,null,{"$f":"'1'!L35:N35","v":"Godkjent"},null,null,{"$f":"'1'!O35","v":325},{"$f":"'1'!P35","v":"poeng"}]
[{"$f":"'1'!A36","v":"B"},"00:00:00",{"$f":"'1'!C36","v":"A"},"00:00:00",{"$f":"SUM(B36,D36)","v":"00:00:00"},null,null,null,null,null,null,{"$f":"'1'!L36:N36","v":"- Derav i spesialøvelsene"},null,null,195,{"$f":"'1'!P36","v":"poeng"}]
[{"$f":"'1'!A37","v":"A"},"00:00:00",{"$f":"'1'!C37","v":"B"},"00:00:00",{"$f":"SUM(B37,D37)","v":"00:00:00"},null,null,null,null,null,null,"- Derav i lydighetsøvelsene",null,null,130,{"$f":"'1'!P37","v":"poeng"}]
[{"$f":"'1'!A38","v":"C"},"00:00:00",{"$f":"'1'!C38","v":"A"},"00:00:00",{"$f":"SUM(B38,D38)","v":"00:00:00"},null,null,null,null,null,null,{"$f":"'1'!L38:N38","v":"Cert/CACIT"},null,null,575,{"$f":"'1'!P38","v":"poeng"}]
[{"$f":"'1'!A39","v":"A"},"00:00:00",{"$f":"'1'!C39","v":"D"},"00:00:00",{"$f":"SUM(E35:J38)","v":"00:00:00"},null,null,null,null,null,null,{"$f":"'1'!L39:N39","v":"- Derav i spesialøvelsene"},null,null,312,{"$f":"'1'!P39","v":"poeng"}]
[{"$f":"'1'!A40","v":"Anvendt tid totalt:"},null,null,null,{"$f":"SUM(E36:J39)","v":"00:00:00"},null,null,null,null,null,null,{"$f":"'1'!L40:N40","v":"- Derav i lydighetsøvelsene"},null,null,208,{"$f":"'1'!P40","v":"poeng"}]
[{"$f":"'1'!A41","v":"Øvelser:"},null,null,null,null,{"$f":"'1'!F41","v":"Koeff."},{"$f":"'1'!G41","v":"Karakter"},{"$f":"'1'!H41","v":"Karakter"},"Snitt",{"$f":"'1'!J41","v":"Poeng"}]
[{"$f":"'1'!A42","v":11},{"$f":"'1'!B42","v":"Feltsøk"},null,null,null,10,null,null,{"$f":"IF(G42=\"\",\"\",IF(H42=\"\",\"\",(G42+H42)/2))","v":""},{"$f":"IF(I42=\"\",\"\",IF(I42=0,\"I.G.\",I42*F42))","v":""},null,null,null,null,{"$f":"'1'!O42:P42","v":"Poeng"}]
[{"$f":"'1'!A43","v":12},{"$f":"'1'!B43","v":"Rapport"},null,null,null,{"$f":"'1'!F43","v":29},null,null,{"$f":"IF(G43=\"\",\"\",IF(H43=\"\",\"\",(G43+H43)/2))","v":""},{"$f":"IF(I43=\"\",\"\",IF(I43=0,\"I.G.\",I43*F43))","v":""},null,{"$f":"'1'!L43:N43","v":"Sum Lydighet"},null,null,{"$f":"J22","v":0}]
[{"$f":"'1'!A44","v":"Sum spesialøvelser:"},null,null,null,null,{"$f":"SUM(F42:F43)","v":39},null,null,null,null,null,{"$f":"'1'!L44:N44","v":"Sum Spesialøvelser"},null,null,{"$f":"IF(Resultatskj!H4=\"Rundering\",J33,IF(Resultatskj!H4=\"Spor\",J28,IF(Resultatskj!H4=\"Rapport\",J44,\"\")))","v":""}]
[null,null,null,null,null,null,null,null,null,null,null,{"$f":"'1'!L45:N45","v":"Totalpoeng"},null,null,{"$f":"SUM(O43:P44)","v":0}]
[null,null,null,null,null,null,null,null,null,null,null,{"$f":"'1'!L46","v":"Ikke godkj."},{"$f":"'1'!M46","v":"Godkj."},null,{"$f":"'1'!O46","v":"Cert"},{"$f":"'1'!P46","v":"Plass"}]
[{"$f":"IF(Resultatskj!C3=\"\",\"\",Resultatskj!C3)","v":""},null,null,null,null,{"$f":"IF(Resultatskj!C4=\"\",\"\",Resultatskj!C4)","v":""},null,null,null,null,null,{"$f":"IF(OR(O45<O35,O44<O36,O43<O37,O45=\"\"),\"X\",\"\")","v":"X"},{"$f":"IF(AND(O45>=O35,O44>=O36,O43>=O37,L47=\"\"),\"X\",\"\")","v":""},null,{"$f":"IF(AND(O45>=575,O44>=311.99,O43>207.99,L47=\"\"),\"X\",\"\")","v":""},{"$f":"Resultatskj!A19","v":"-"}]
["Underskrift dommere",null,null,null,null,null,null,null,null,null,null,{"$f":"Resultatskj!K26","v":"B.Strand/A.Bakken 15.07.2015/19.06.2018"}]
[]
[{"$f":"IF(Resultatskj!$C$3=\"\",\"\",Resultatskj!$C$3)","v":""}]
[{"$f":"IF(Resultatskj!$C$4=\"\",\"\",Resultatskj!$C$4)","v":""}]

{"sheet":"13","index":14,"n_rows":51,"n_cols":16,"rows_kept":51,"cut":false,"hidden":false,"merged":[[50,0,50,9],[16,10,16,15],[18,1,18,4],[15,10,15,15],[17,10,17,15],[30,1,30,4],[23,10,23,15],[24,10,24,15],[30,10,30,15],[25,10,25,15],[29,10,29,15],[18,10,18,15],[20,10,20,15],[21,10,21,15],[22,0,22,15],[19,10,19,15],[0,5,0,15],[26,10,26,15],[43,11,43,13],[2,2,2,9],[36,4,36,9],[38,11,38,13],[37,11,37,13],[37,4,37,9],[31,10,31,15],[2,12,2,15],[14,10,14,15],[9,0,9,15],[14,1,14,4],[2,0,2,1],[2,10,2,11],[15,1,15,4],[1,0,1,1],[1,2,1,5],[1,10,1,12],[3,10,3,11],[3,0,3,1],[3,2,3,9],[3,12,3,15],[4,0,4,1],[4,2,4,9],[4,10,4,11],[4,12,4,15],[13,1,13,4],[13,10,13,15],[12,10,12,15],[10,0,10,4],[10,10,10,15],[11,1,11,4],[11,10,11,15],[33,0,33,15],[34,0,34,1],[34,2,34,3],[39,0,39,3],[39,4,39,9],[35,11,35,13],[35,4,35,9],[38,4,38,9],[32,10,32,15],[27,10,27,15],[28,0,28,15],[29,0,29,4],[31,1,31,4],[32,0,32,4],[23,0,23,4],[26,1,26,4],[27,0,27,4],[16,1,16,4],[17,1,17,4],[24,1,24,4],[25,1,25,4],[20,1,20,4],[21,0,21,4],[19,1,19,4],[0,2,0,4],[42,14,42,15],[42,11,42,13],[45,12,45,13],[46,12,46,13],[34,4,34,9],[34,11,34,13],[44,0,46,9],[44,11,44,13],[44,14,44,15],[43,14,43,15],[40,0,40,4],[41,11,41,13],[41,14,41,15],[41,1,41,4],[12,1,12,4],[49,11,49,15],[47,11,47,15],[36,11,36,13],[42,1,42,4],[43,0,43,4],[47,0,47,9],[39,11,39,13],[49,0,49,9]]}
[null,null,null,null,null,{"$f":"'1'!F1:R1","v":"Kl. A - DOMMERPROTOKOLL"}]
[{"$f":"'1'!A2:B2","v":"Dato:"},null,{"$f":"IF(Resultatskj!L2=\"\",\"\",Resultatskj!L2)","v":""},null,null,null,null,null,null,{"$f":"'1'!J2","v":"Gruppe:"},{"$f":"IF(Resultatskj!H4=\"\",\"\",Resultatskj!H4)","v":"Spor"},null,null,null,"Katalog nr.",{"$f":"Resultatskj!B20","v":""}]
[{"$f":"'1'!A3:B3","v":"Arrangør:"},null,{"$f":"IF(Resultatskj!$C$2=\"\",\"\",Resultatskj!$C$2)","v":"Norsk Brukshundsports Forbund"},null,null,null,null,null,null,null,{"$f":"'1'!K3:L3","v":"Hundens navn:"}]
[{"$f":"'1'!A4:B4","v":"Fører:"},null,null,null,null,null,null,null,null,null,{"$f":"'1'!K4:L4","v":"Reg.nr.:"}]
[{"$f":"'1'!A5:B5","v":"Klubb:"},null,null,null,null,null,null,null,null,null,{"$f":"'1'!K5:L5","v":"Rase:"}]
[]
[null,"Klasse",null,"Liten",null,null,null,null,null,"Middels",null,null,"Stor"]
[]
[]
[{"$f":"'1'!A10","v":"Lydighet:"}]
[{"$f":"'1'!A11","v":"Øvelser:"},null,null,null,null,"Koeff.","Karakter","Karakter","Snitt","Poeng"]
[{"$f":"'1'!A12","v":1},{"$f":"'1'!B12","v":"Fri ved foten"},null,null,null,3,null,null,{"$f":"IF(G12=\"\",\"\",IF(H12=\"\",\"\",(G12+H12)/2))","v":""},{"$f":"IF(I12=\"\",\"\",IF(I12=0,\"I.G.\",I12*F12))","v":""}]
[{"$f":"'1'!A13","v":2},{"$f":"'1'!B13","v":"Innkalling m/stå og dekk"},null,null,null,3,null,null,{"$f":"IF(G13=\"\",\"\",IF(H13=\"\",\"\",(G13+H13)/2))","v":""},{"$f":"IF(I13=\"\",\"\",IF(I13=0,\"I.G.\",I13*F13))","v":""}]
[{"$f":"'1'!A14","v":3},{"$f":"'1'!B14","v":"Fremadsending"},null,null,null,3,null,null,"",""]
[{"$f":"'1'!A15","v":4},{"$f":"'1'!B15","v":"Kryp"},null,null,null,3,null,null,"",""]
[{"$f":"'1'!A16","v":5},{"$f":"'1'!B16","v":"Hals på kommando"},null,null,null,2,null,null,"",""]
[{"$f":"'1'!A17","v":6},{"$f":"'1'!B17","v":"Apportering metallapport"},null,null,null,3,null,null,"",""]
[{"$f":"'1'!A18","v":7},{"$f":"'1'!B18","v":"Apportering tung gjenstand"},null,null,null,3,null,null,"",""]
[{"$f":"'1'!A19","v":8},"Fritt hopp over hinder",null,null,null,2,null,null,"",""]
[{"$f":"'1'!A20","v":9},{"$f":"'1'!B20","v":"Stigeklatring"},null,null,null,2,null,null,"",""]
[{"$f":"'1'!A21","v":10},{"$f":"'1'!B21","v":"Fellesdekk"},null,null,null,2,null,null,"",""]
[{"$f":"'1'!A22","v":"Sum lydighet:"},null,null,null,null,{"$f":"SUM(F12:F21)","v":26},null,null,null,{"$f":"SUM(J12:J21)","v":0}]
[{"$f":"'1'!A23","v":"Sporgruppen:"}]
[{"$f":"'1'!A24","v":"Øvelser:"},null,null,null,null,"Koeff.","Karakter","Karakter","Snitt","Poeng"]
[{"$f":"'1'!A25","v":11},{"$f":"'1'!B25","v":"Feltsøk"},null,null,null,10,null,null,{"$f":"IF(G25=\"\",\"\",IF(H25=\"\",\"\",(G25+H25)/2))","v":""},{"$f":"IF(I25=\"\",\"\",IF(I25=0,\"I.G.\",I25*F25))","v":""}]
[{"$f":"'1'!A26","v":12},{"$f":"'1'!B26","v":"Sporoppsøk"},null,null,null,5,null,null,{"$f":"IF(G26=\"\",\"\",IF(H26=\"\",\"\",(G26+H26)/2))","v":""},{"$f":"IF(I26=\"\",\"\",IF(I26=0,\"I.G.\",I26*F26))","v":""}]
[{"$f":"'1'!A27","v":13},{"$f":"'1'!B27","v":"Spor"},null,null,null,24,null,null,"",""]
[{"$f":"'1'!A28","v":"Sum spesialøvelser:"},null,null,null,null,{"$f":"SUM(F25:F27)","v":39},null,null,null,{"$f":"IF(AND(J25=\"\",J26=\"\",J27=\"\"),\"\",SUM(J25:J27))","v":""}]
[{"$f":"'1'!A29","v":"Runderingsgruppen:"}]
[{"$f":"'1'!A30","v":"Øvelser:"},null,null,null,null,"Koeff.","Karakter","Karakter","Snitt","Poeng"]
[{"$f":"'1'!A31","v":11},{"$f":"'1'!B31","v":"Feltsøk"},null,null,null,10,null,null,{"$f":"IF(G31=\"\",\"\",IF(H31=\"\",\"\",(G31+H31)/2))","v":""},{"$f":"IF(I31=\"\",\"\",IF(I31=0,\"I.G.\",I31*F31))","v":""}]
[{"$f":"'1'!A32","v":12},{"$f":"'1'!B32","v":"Rundering"},null,null,null,{"$f":"'1'!F32","v":29},null,null,{"$f":"IF(G32=\"\",\"\",IF(H32=\"\",\"\",(G32+H32)/2))","v":""},{"$f":"IF(I32=\"\",\"\",IF(I32=0,\"I.G.\",I32*F32))","v":""}]
[{"$f":"'1'!A33","v":"Sum spesialøvelser:"},null,null,null,null,{"$f":"SUM(F31:F32)","v":39},null,null,null,{"$f":"IF(AND(J31=\"\",J32=\"\"),\"\",SUM(J31:J32))","v":""},null,"Godkjent",null,null,300,"poeng"]
[{"$f":"'1'!A34","v":"Rapportgruppen:"}]
[{"$f":"'1'!A35","v":"Start kl.:"},0,{"$f":"'1'!C35","v":"Ankomst kl.:"},0,{"$f":"'1'!E35:J35","v":"Anvendt tid:"},null,null,null,null,null,null,{"$f":"'1'!L35:N35","v":"Godkjent"},null,null,{"$f":"'1'!O35","v":325},{"$f":"'1'!P35","v":"poeng"}]
[{"$f":"'1'!A36","v":"B"},"00:00:00",{"$f":"'1'!C36","v":"A"},"00:00:00",{"$f":"SUM(B36,D36)","v":"00:00:00"},null,null,null,null,null,null,{"$f":"'1'!L36:N36","v":"- Derav i spesialøvelsene"},null,null,195,{"$f":"'1'!P36","v":"poeng"}]
[{"$f":"'1'!A37","v":"A"},"00:00:00",{"$f":"'1'!C37","v":"B"},"00:00:00",{"$f":"SUM(B37,D37)","v":"00:00:00"},null,null,null,null,null,null,"- Derav i lydighetsøvelsene",null,null,130,{"$f":"'1'!P37","v":"poeng"}]
[{"$f":"'1'!A38","v":"C"},"00:00:00",{"$f":"'1'!C38","v":"A"},"00:00:00",{"$f":"SUM(B38,D38)","v":"00:00:00"},null,null,null,null,null,null,{"$f":"'1'!L38:N38","v":"Cert/CACIT"},null,null,575,{"$f":"'1'!P38","v":"poeng"}]
[{"$f":"'1'!A39","v":"A"},"00:00:00",{"$f":"'1'!C39","v":"D"},"00:00:00",{"$f":"SUM(E35:J38)","v":"00:00:00"},null,null,null,null,null,null,{"$f":"'1'!L39:N39","v":"- Derav i spesialøvelsene"},null,null,312,{"$f":"'1'!P39","v":"poeng"}]
[{"$f":"'1'!A40","v":"Anvendt tid totalt:"},null,null,null,{"$f":"SUM(E36:J39)","v":"00:00:00"},null,null,null,null,null,null,{"$f":"'1'!L40:N40","v":"- Derav i lydighetsøvelsene"},null,null,208,{"$f":"'1'!P40","v":"poeng"}]
[{"$f":"'1'!A41","v":"Øvelser:"},null,null,null,null,{"$f":"'1'!F41","v":"Koeff."},{"$f":"'1'!G41","v":"Karakter"},{"$f":"'1'!H41","v":"Karakter"},"Snitt",{"$f":"'1'!J41","v":"Poeng"}]
[{"$f":"'1'!A42","v":11},{"$f":"'1'!B42","v":"Feltsøk"},null,null,null,10,null,null,{"$f":"IF(G42=\"\",\"\",IF(H42=\"\",\"\",(G42+H42)/2))","v":""},{"$f":"IF(I42=\"\",\"\",IF(I42=0,\"I.G.\",I42*F42))","v":""},null,null,null,null,{"$f":"'1'!O42:P42","v":"Poeng"}]
[{"$f":"'1'!A43","v":12},{"$f":"'1'!B43","v":"Rapport"},null,null,null,{"$f":"'1'!F43","v":29},null,null,{"$f":"IF(G43=\"\",\"\",IF(H43=\"\",\"\",(G43+H43)/2))","v":""},{"$f":"IF(I43=\"\",\"\",IF(I43=0,\"I.G.\",I43*F43))","v":""},null,{"$f":"'1'!L43:N43","v":"Sum Lydighet"},null,null,{"$f":"J22","v":0}]
[{"$f":"'1'!A44","v":"Sum spesialøvelser:"},null,null,null,null,{"$f":"SUM(F42:F43)","v":39},null,null,null,null,null,{"$f":"'1'!L44:N44","v":"Sum Spesialøvelser"},null,null,{"$f":"IF(Resultatskj!H4=\"Rundering\",J33,IF(Resultatskj!H4=\"Spor\",J28,IF(Resultatskj!H4=\"Rapport\",J44,\"\")))","v":""}]
[null,null,null,null,null,null,null,null,null,null,null,{"$f":"'1'!L45:N45","v":"Totalpoeng"},null,null,{"$f":"SUM(O43:P44)","v":0}]
[null,null,null,null,null,null,null,null,null,null,null,{"$f":"'1'!L46","v":"Ikke godkj."},{"$f":"'1'!M46","v":"Godkj."},null,{"$f":"'1'!O46","v":"Cert"},{"$f":"'1'!P46","v":"Plass"}]
[{"$f":"IF(Resultatskj!C3=\"\",\"\",Resultatskj!C3)","v":""},null,null,null,null,{"$f":"IF(Resultatskj!C4=\"\",\"\",Resultatskj!C4)","v":""},null,null,null,null,null,{"$f":"IF(OR(O45<O35,O44<O36,O43<O37,O45=\"\"),\"X\",\"\")","v":"X"},{"$f":"IF(AND(O45>=O35,O44>=O36,O43>=O37,L47=\"\"),\"X\",\"\")","v":""},null,{"$f":"IF(AND(O45>=575,O44>=311.99,O43>207.99,L47=\"\"),\"X\",\"\")","v":""},{"$f":"Resultatskj!A20","v":"-"}]
["Underskrift dommere",null,null,null,null,null,null,null,null,null,null,{"$f":"Resultatskj!K26","v":"B.Strand/A.Bakken 15.07.2015/19.06.2018"}]
[]
[{"$f":"IF(Resultatskj!$C$3=\"\",\"\",Resultatskj!$C$3)","v":""}]
[{"$f":"IF(Resultatskj!$C$4=\"\",\"\",Resultatskj!$C$4)","v":""}]

{"sheet":"14","index":15,"n_rows":51,"n_cols":16,"rows_kept":51,"cut":false,"hidden":false,"merged":[[50,0,50,9],[26,10,26,15],[25,10,25,15],[9,0,9,15],[14,1,14,4],[24,1,24,4],[25,1,25,4],[14,10,14,15],[16,10,16,15],[17,10,17,15],[20,1,20,4],[21,0,21,4],[10,10,10,15],[11,10,11,15],[12,10,12,15],[41,14,41,15],[3,0,3,1],[3,2,3,9],[3,10,3,11],[3,12,3,15],[4,0,4,1],[1,0,1,1],[0,2,0,4],[2,0,2,1],[2,2,2,9],[2,10,2,11],[38,11,38,13],[35,4,35,9],[36,4,36,9],[0,5,0,15],[1,10,1,12],[1,2,1,5],[2,12,2,15],[4,2,4,9],[4,10,4,11],[4,12,4,15],[23,0,23,4],[23,10,23,15],[24,10,24,15],[41,1,41,4],[34,4,34,9],[40,0,40,4],[41,11,41,13],[34,2,34,3],[39,11,39,13],[39,0,39,3],[39,4,39,9],[35,11,35,13],[37,11,37,13],[36,11,36,13],[38,4,38,9],[37,4,37,9],[10,0,10,4],[13,10,13,15],[11,1,11,4],[12,1,12,4],[13,1,13,4],[18,10,18,15],[18,1,18,4],[33,0,33,15],[15,1,15,4],[15,10,15,15],[16,1,16,4],[17,1,17,4],[22,0,22,15],[29,0,29,4],[31,1,31,4],[19,1,19,4],[19,10,19,15],[20,10,20,15],[21,10,21,15],[30,1,30,4],[28,0,28,15],[34,0,34,1],[34,11,34,13],[26,1,26,4],[32,0,32,4],[27,0,27,4],[27,10,27,15],[32,10,32,15],[31,10,31,15],[30,10,30,15],[29,10,29,15],[42,1,42,4],[43,0,43,4],[44,11,44,13],[42,11,42,13],[44,14,44,15],[43,14,43,15],[43,11,43,13],[42,14,42,15],[44,0,46,9],[49,11,49,15],[47,11,47,15],[45,12,45,13],[46,12,46,13],[47,0,47,9],[49,0,49,9]]}
[null,null,null,null,null,{"$f":"'1'!F1:R1","v":"Kl. A - DOMMERPROTOKOLL"}]
[{"$f":"'1'!A2:B2","v":"Dato:"},null,{"$f":"IF(Resultatskj!L2=\"\",\"\",Resultatskj!L2)","v":""},null,null,null,null,null,null,{"$f":"'1'!J2","v":"Gruppe:"},{"$f":"IF(Resultatskj!H4=\"\",\"\",Resultatskj!H4)","v":"Spor"},null,null,null,"Katalog nr.",{"$f":"Resultatskj!B21","v":""}]
[{"$f":"'1'!A3:B3","v":"Arrangør:"},null,{"$f":"IF(Resultatskj!$C$2=\"\",\"\",Resultatskj!$C$2)","v":"Norsk Brukshundsports Forbund"},null,null,null,null,null,null,null,{"$f":"'1'!K3:L3","v":"Hundens navn:"}]
[{"$f":"'1'!A4:B4","v":"Fører:"},null,null,null,null,null,null,null,null,null,{"$f":"'1'!K4:L4","v":"Reg.nr.:"}]
[{"$f":"'1'!A5:B5","v":"Klubb:"},null,null,null,null,null,null,null,null,null,{"$f":"'1'!K5:L5","v":"Rase:"}]
[]
[null,"Klasse",null,"Liten",null,null,null,null,null,"Middels",null,null,"Stor"]
[]
[]
[{"$f":"'1'!A10","v":"Lydighet:"}]
[{"$f":"'1'!A11","v":"Øvelser:"},null,null,null,null,"Koeff.","Karakter","Karakter","Snitt","Poeng"]
[{"$f":"'1'!A12","v":1},{"$f":"'1'!B12","v":"Fri ved foten"},null,null,null,3,null,null,{"$f":"IF(G12=\"\",\"\",IF(H12=\"\",\"\",(G12+H12)/2))","v":""},{"$f":"IF(I12=\"\",\"\",IF(I12=0,\"I.G.\",I12*F12))","v":""}]
[{"$f":"'1'!A13","v":2},{"$f":"'1'!B13","v":"Innkalling m/stå og dekk"},null,null,null,3,null,null,{"$f":"IF(G13=\"\",\"\",IF(H13=\"\",\"\",(G13+H13)/2))","v":""},{"$f":"IF(I13=\"\",\"\",IF(I13=0,\"I.G.\",I13*F13))","v":""}]
[{"$f":"'1'!A14","v":3},{"$f":"'1'!B14","v":"Fremadsending"},null,null,null,3,null,null,"",""]
[{"$f":"'1'!A15","v":4},{"$f":"'1'!B15","v":"Kryp"},null,null,null,3,null,null,"",""]
[{"$f":"'1'!A16","v":5},{"$f":"'1'!B16","v":"Hals på kommando"},null,null,null,2,null,null,"",""]
[{"$f":"'1'!A17","v":6},{"$f":"'1'!B17","v":"Apportering metallapport"},null,null,null,3,null,null,"",""]
[{"$f":"'1'!A18","v":7},{"$f":"'1'!B18","v":"Apportering tung gjenstand"},null,null,null,3,null,null,"",""]
[{"$f":"'1'!A19","v":8},"Fritt hopp over hinder",null,null,null,2,null,null,"",""]
[{"$f":"'1'!A20","v":9},{"$f":"'1'!B20","v":"Stigeklatring"},null,null,null,2,null,null,"",""]
[{"$f":"'1'!A21","v":10},{"$f":"'1'!B21","v":"Fellesdekk"},null,null,null,2,null,null,"",""]
[{"$f":"'1'!A22","v":"Sum lydighet:"},null,null,null,null,{"$f":"SUM(F12:F21)","v":26},null,null,null,{"$f":"SUM(J12:J21)","v":0}]
[{"$f":"'1'!A23","v":"Sporgruppen:"}]
[{"$f":"'1'!A24","v":"Øvelser:"},null,null,null,null,"Koeff.","Karakter","Karakter","Snitt","Poeng"]
[{"$f":"'1'!A25","v":11},{"$f":"'1'!B25","v":"Feltsøk"},null,null,null,10,null,null,{"$f":"IF(G25=\"\",\"\",IF(H25=\"\",\"\",(G25+H25)/2))","v":""},{"$f":"IF(I25=\"\",\"\",IF(I25=0,\"I.G.\",I25*F25))","v":""}]
[{"$f":"'1'!A26","v":12},{"$f":"'1'!B26","v":"Sporoppsøk"},null,null,null,5,null,null,{"$f":"IF(G26=\"\",\"\",IF(H26=\"\",\"\",(G26+H26)/2))","v":""},{"$f":"IF(I26=\"\",\"\",IF(I26=0,\"I.G.\",I26*F26))","v":""}]
[{"$f":"'1'!A27","v":13},{"$f":"'1'!B27","v":"Spor"},null,null,null,24,null,null,"",""]
[{"$f":"'1'!A28","v":"Sum spesialøvelser:"},null,null,null,null,{"$f":"SUM(F25:F27)","v":39},null,null,null,{"$f":"IF(AND(J25=\"\",J26=\"\",J27=\"\"),\"\",SUM(J25:J27))","v":""}]
[{"$f":"'1'!A29","v":"Runderingsgruppen:"}]
[{"$f":"'1'!A30","v":"Øvelser:"},null,null,null,null,"Koeff.","Karakter","Karakter","Snitt","Poeng"]
[{"$f":"'1'!A31","v":11},{"$f":"'1'!B31","v":"Feltsøk"},null,null,null,10,null,null,{"$f":"IF(G31=\"\",\"\",IF(H31=\"\",\"\",(G31+H31)/2))","v":""},{"$f":"IF(I31=\"\",\"\",IF(I31=0,\"I.G.\",I31*F31))","v":""}]
[{"$f":"'1'!A32","v":12},{"$f":"'1'!B32","v":"Rundering"},null,null,null,{"$f":"'1'!F32","v":29},null,null,{"$f":"IF(G32=\"\",\"\",IF(H32=\"\",\"\",(G32+H32)/2))","v":""},{"$f":"IF(I32=\"\",\"\",IF(I32=0,\"I.G.\",I32*F32))","v":""}]
[{"$f":"'1'!A33","v":"Sum spesialøvelser:"},null,null,null,null,{"$f":"SUM(F31:F32)","v":39},null,null,null,{"$f":"IF(AND(J31=\"\",J32=\"\"),\"\",SUM(J31:J32))","v":""},null,"Godkjent",null,null,300,"poeng"]
[{"$f":"'1'!A34","v":"Rapportgruppen:"}]
[{"$f":"'1'!A35","v":"Start kl.:"},0,{"$f":"'1'!C35","v":"Ankomst kl.:"},0,{"$f":"'1'!E35:J35","v":"Anvendt tid:"},null,null,null,null,null,null,{"$f":"'1'!L35:N35","v":"Godkjent"},null,null,{"$f":"'1'!O35","v":325},{"$f":"'1'!P35","v":"poeng"}]
[{"$f":"'1'!A36","v":"B"},"00:00:00",{"$f":"'1'!C36","v":"A"},"00:00:00",{"$f":"SUM(B36,D36)","v":"00:00:00"},null,null,null,null,null,null,{"$f":"'1'!L36:N36","v":"- Derav i spesialøvelsene"},null,null,195,{"$f":"'1'!P36","v":"poeng"}]
[{"$f":"'1'!A37","v":"A"},"00:00:00",{"$f":"'1'!C37","v":"B"},"00:00:00",{"$f":"SUM(B37,D37)","v":"00:00:00"},null,null,null,null,null,null,"- Derav i lydighetsøvelsene",null,null,130,{"$f":"'1'!P37","v":"poeng"}]
[{"$f":"'1'!A38","v":"C"},"00:00:00",{"$f":"'1'!C38","v":"A"},"00:00:00",{"$f":"SUM(B38,D38)","v":"00:00:00"},null,null,null,null,null,null,{"$f":"'1'!L38:N38","v":"Cert/CACIT"},null,null,575,{"$f":"'1'!P38","v":"poeng"}]
[{"$f":"'1'!A39","v":"A"},"00:00:00",{"$f":"'1'!C39","v":"D"},"00:00:00",{"$f":"SUM(E35:J38)","v":"00:00:00"},null,null,null,null,null,null,{"$f":"'1'!L39:N39","v":"- Derav i spesialøvelsene"},null,null,312,{"$f":"'1'!P39","v":"poeng"}]
[{"$f":"'1'!A40","v":"Anvendt tid totalt:"},null,null,null,{"$f":"SUM(E36:J39)","v":"00:00:00"},null,null,null,null,null,null,{"$f":"'1'!L40:N40","v":"- Derav i lydighetsøvelsene"},null,null,208,{"$f":"'1'!P40","v":"poeng"}]
[{"$f":"'1'!A41","v":"Øvelser:"},null,null,null,null,{"$f":"'1'!F41","v":"Koeff."},{"$f":"'1'!G41","v":"Karakter"},{"$f":"'1'!H41","v":"Karakter"},"Snitt",{"$f":"'1'!J41","v":"Poeng"}]
[{"$f":"'1'!A42","v":11},{"$f":"'1'!B42","v":"Feltsøk"},null,null,null,10,null,null,{"$f":"IF(G42=\"\",\"\",IF(H42=\"\",\"\",(G42+H42)/2))","v":""},{"$f":"IF(I42=\"\",\"\",IF(I42=0,\"I.G.\",I42*F42))","v":""},null,null,null,null,{"$f":"'1'!O42:P42","v":"Poeng"}]
[{"$f":"'1'!A43","v":12},{"$f":"'1'!B43","v":"Rapport"},null,null,null,{"$f":"'1'!F43","v":29},null,null,{"$f":"IF(G43=\"\",\"\",IF(H43=\"\",\"\",(G43+H43)/2))","v":""},{"$f":"IF(I43=\"\",\"\",IF(I43=0,\"I.G.\",I43*F43))","v":""},null,{"$f":"'1'!L43:N43","v":"Sum Lydighet"},null,null,{"$f":"J22","v":0}]
[{"$f":"'1'!A44","v":"Sum spesialøvelser:"},null,null,null,null,{"$f":"SUM(F42:F43)","v":39},null,null,null,null,null,{"$f":"'1'!L44:N44","v":"Sum Spesialøvelser"},null,null,{"$f":"IF(Resultatskj!H4=\"Rundering\",J33,IF(Resultatskj!H4=\"Spor\",J28,IF(Resultatskj!H4=\"Rapport\",J44,\"\")))","v":""}]
[null,null,null,null,null,null,null,null,null,null,null,{"$f":"'1'!L45:N45","v":"Totalpoeng"},null,null,{"$f":"SUM(O43:P44)","v":0}]
[null,null,null,null,null,null,null,null,null,null,null,{"$f":"'1'!L46","v":"Ikke godkj."},{"$f":"'1'!M46","v":"Godkj."},null,{"$f":"'1'!O46","v":"Cert"},{"$f":"'1'!P46","v":"Plass"}]
[{"$f":"IF(Resultatskj!C3=\"\",\"\",Resultatskj!C3)","v":""},null,null,null,null,{"$f":"IF(Resultatskj!C4=\"\",\"\",Resultatskj!C4)","v":""},null,null,null,null,null,{"$f":"IF(OR(O45<O35,O44<O36,O43<O37,O45=\"\"),\"X\",\"\")","v":"X"},{"$f":"IF(AND(O45>=O35,O44>=O36,O43>=O37,L47=\"\"),\"X\",\"\")","v":""},null,{"$f":"IF(AND(O45>=575,O44>=311.99,O43>207.99,L47=\"\"),\"X\",\"\")","v":""},{"$f":"Resultatskj!A21","v":"-"}]
["Underskrift dommere",null,null,null,null,null,null,null,null,null,null,{"$f":"Resultatskj!K26","v":"B.Strand/A.Bakken 15.07.2015/19.06.2018"}]
[]
[{"$f":"IF(Resultatskj!$C$3=\"\",\"\",Resultatskj!$C$3)","v":""}]
[{"$f":"IF(Resultatskj!$C$4=\"\",\"\",Resultatskj!$C$4)","v":""}]

{"sheet":"15","index":16,"n_rows":51,"n_cols":16,"rows_kept":51,"cut":false,"hidden":false,"merged":[[50,0,50,9],[16,10,16,15],[18,1,18,4],[15,10,15,15],[17,10,17,15],[30,1,30,4],[23,10,23,15],[24,10,24,15],[30,10,30,15],[25,10,25,15],[29,10,29,15],[18,10,18,15],[20,10,20,15],[21,10,21,15],[22,0,22,15],[19,10,19,15],[0,5,0,15],[26,10,26,15],[43,11,43,13],[2,2,2,9],[36,4,36,9],[38,11,38,13],[37,11,37,13],[37,4,37,9],[31,10,31,15],[2,12,2,15],[14,10,14,15],[9,0,9,15],[14,1,14,4],[2,0,2,1],[2,10,2,11],[15,1,15,4],[1,0,1,1],[1,2,1,5],[1,10,1,12],[3,10,3,11],[3,0,3,1],[3,2,3,9],[3,12,3,15],[4,0,4,1],[4,2,4,9],[4,10,4,11],[4,12,4,15],[13,1,13,4],[13,10,13,15],[12,10,12,15],[10,0,10,4],[10,10,10,15],[11,1,11,4],[11,10,11,15],[33,0,33,15],[34,0,34,1],[34,2,34,3],[39,0,39,3],[39,4,39,9],[35,11,35,13],[35,4,35,9],[38,4,38,9],[32,10,32,15],[27,10,27,15],[28,0,28,15],[29,0,29,4],[31,1,31,4],[32,0,32,4],[23,0,23,4],[26,1,26,4],[27,0,27,4],[16,1,16,4],[17,1,17,4],[24,1,24,4],[25,1,25,4],[20,1,20,4],[21,0,21,4],[19,1,19,4],[0,2,0,4],[42,14,42,15],[42,11,42,13],[45,12,45,13],[46,12,46,13],[34,4,34,9],[34,11,34,13],[44,0,46,9],[44,11,44,13],[44,14,44,15],[43,14,43,15],[40,0,40,4],[41,11,41,13],[41,14,41,15],[41,1,41,4],[12,1,12,4],[49,11,49,15],[47,11,47,15],[36,11,36,13],[42,1,42,4],[43,0,43,4],[47,0,47,9],[39,11,39,13],[49,0,49,9]]}
[null,null,null,null,null,{"$f":"'1'!F1:R1","v":"Kl. A - DOMMERPROTOKOLL"}]
[{"$f":"'1'!A2:B2","v":"Dato:"},null,{"$f":"IF(Resultatskj!L2=\"\",\"\",Resultatskj!L2)","v":""},null,null,null,null,null,null,{"$f":"'1'!J2","v":"Gruppe:"},{"$f":"IF(Resultatskj!H4=\"\",\"\",Resultatskj!H4)","v":"Spor"},null,null,null,"Katalog nr.",{"$f":"Resultatskj!B22","v":""}]
[{"$f":"'1'!A3:B3","v":"Arrangør:"},null,{"$f":"IF(Resultatskj!$C$2=\"\",\"\",Resultatskj!$C$2)","v":"Norsk Brukshundsports Forbund"},null,null,null,null,null,null,null,{"$f":"'1'!K3:L3","v":"Hundens navn:"}]
[{"$f":"'1'!A4:B4","v":"Fører:"},null,null,null,null,null,null,null,null,null,{"$f":"'1'!K4:L4","v":"Reg.nr.:"}]
[{"$f":"'1'!A5:B5","v":"Klubb:"},null,null,null,null,null,null,null,null,null,{"$f":"'1'!K5:L5","v":"Rase:"}]
[]
[null,"Klasse",null,"Liten",null,null,null,null,null,"Middels",null,null,"Stor"]
[]
[]
[{"$f":"'1'!A10","v":"Lydighet:"}]
[{"$f":"'1'!A11","v":"Øvelser:"},null,null,null,null,"Koeff.","Karakter","Karakter","Snitt","Poeng"]
[{"$f":"'1'!A12","v":1},{"$f":"'1'!B12","v":"Fri ved foten"},null,null,null,3,null,null,{"$f":"IF(G12=\"\",\"\",IF(H12=\"\",\"\",(G12+H12)/2))","v":""},{"$f":"IF(I12=\"\",\"\",IF(I12=0,\"I.G.\",I12*F12))","v":""}]
[{"$f":"'1'!A13","v":2},{"$f":"'1'!B13","v":"Innkalling m/stå og dekk"},null,null,null,3,null,null,{"$f":"IF(G13=\"\",\"\",IF(H13=\"\",\"\",(G13+H13)/2))","v":""},{"$f":"IF(I13=\"\",\"\",IF(I13=0,\"I.G.\",I13*F13))","v":""}]
[{"$f":"'1'!A14","v":3},{"$f":"'1'!B14","v":"Fremadsending"},null,null,null,3,null,null,"",""]
[{"$f":"'1'!A15","v":4},{"$f":"'1'!B15","v":"Kryp"},null,null,null,3,null,null,"",""]
[{"$f":"'1'!A16","v":5},{"$f":"'1'!B16","v":"Hals på kommando"},null,null,null,2,null,null,"",""]
[{"$f":"'1'!A17","v":6},{"$f":"'1'!B17","v":"Apportering metallapport"},null,null,null,3,null,null,"",""]
[{"$f":"'1'!A18","v":7},{"$f":"'1'!B18","v":"Apportering tung gjenstand"},null,null,null,3,null,null,"",""]
[{"$f":"'1'!A19","v":8},"Fritt hopp over hinder",null,null,null,2,null,null,"",""]
[{"$f":"'1'!A20","v":9},{"$f":"'1'!B20","v":"Stigeklatring"},null,null,null,2,null,null,"",""]
[{"$f":"'1'!A21","v":10},{"$f":"'1'!B21","v":"Fellesdekk"},null,null,null,2,null,null,"",""]
[{"$f":"'1'!A22","v":"Sum lydighet:"},null,null,null,null,{"$f":"SUM(F12:F21)","v":26},null,null,null,{"$f":"SUM(J12:J21)","v":0}]
[{"$f":"'1'!A23","v":"Sporgruppen:"}]
[{"$f":"'1'!A24","v":"Øvelser:"},null,null,null,null,"Koeff.","Karakter","Karakter","Snitt","Poeng"]
[{"$f":"'1'!A25","v":11},{"$f":"'1'!B25","v":"Feltsøk"},null,null,null,10,null,null,{"$f":"IF(G25=\"\",\"\",IF(H25=\"\",\"\",(G25+H25)/2))","v":""},{"$f":"IF(I25=\"\",\"\",IF(I25=0,\"I.G.\",I25*F25))","v":""}]
[{"$f":"'1'!A26","v":12},{"$f":"'1'!B26","v":"Sporoppsøk"},null,null,null,5,null,null,{"$f":"IF(G26=\"\",\"\",IF(H26=\"\",\"\",(G26+H26)/2))","v":""},{"$f":"IF(I26=\"\",\"\",IF(I26=0,\"I.G.\",I26*F26))","v":""}]
[{"$f":"'1'!A27","v":13},{"$f":"'1'!B27","v":"Spor"},null,null,null,24,null,null,"",""]
[{"$f":"'1'!A28","v":"Sum spesialøvelser:"},null,null,null,null,{"$f":"SUM(F25:F27)","v":39},null,null,null,{"$f":"IF(AND(J25=\"\",J26=\"\",J27=\"\"),\"\",SUM(J25:J27))","v":""}]
[{"$f":"'1'!A29","v":"Runderingsgruppen:"}]
[{"$f":"'1'!A30","v":"Øvelser:"},null,null,null,null,"Koeff.","Karakter","Karakter","Snitt","Poeng"]
[{"$f":"'1'!A31","v":11},{"$f":"'1'!B31","v":"Feltsøk"},null,null,null,10,null,null,{"$f":"IF(G31=\"\",\"\",IF(H31=\"\",\"\",(G31+H31)/2))","v":""},{"$f":"IF(I31=\"\",\"\",IF(I31=0,\"I.G.\",I31*F31))","v":""}]
[{"$f":"'1'!A32","v":12},{"$f":"'1'!B32","v":"Rundering"},null,null,null,{"$f":"'1'!F32","v":29},null,null,{"$f":"IF(G32=\"\",\"\",IF(H32=\"\",\"\",(G32+H32)/2))","v":""},{"$f":"IF(I32=\"\",\"\",IF(I32=0,\"I.G.\",I32*F32))","v":""}]
[{"$f":"'1'!A33","v":"Sum spesialøvelser:"},null,null,null,null,{"$f":"SUM(F31:F32)","v":39},null,null,null,{"$f":"IF(AND(J31=\"\",J32=\"\"),\"\",SUM(J31:J32))","v":""},null,"Godkjent",null,null,300,"poeng"]
[{"$f":"'1'!A34","v":"Rapportgruppen:"}]
[{"$f":"'1'!A35","v":"Start kl.:"},0,{"$f":"'1'!C35","v":"Ankomst kl.:"},0,{"$f":"'1'!E35:J35","v":"Anvendt tid:"},null,null,null,null,null,null,{"$f":"'1'!L35:N35","v":"Godkjent"},null,null,{"$f":"'1'!O35","v":325},{"$f":"'1'!P35","v":"poeng"}]
[{"$f":"'1'!A36","v":"B"},"00:00:00",{"$f":"'1'!C36","v":"A"},"00:00:00",{"$f":"SUM(B36,D36)","v":"00:00:00"},null,null,null,null,null,null,{"$f":"'1'!L36:N36","v":"- Derav i spesialøvelsene"},null,null,195,{"$f":"'1'!P36","v":"poeng"}]
[{"$f":"'1'!A37","v":"A"},"00:00:00",{"$f":"'1'!C37","v":"B"},"00:00:00",{"$f":"SUM(B37,D37)","v":"00:00:00"},null,null,null,null,null,null,"- Derav i lydighetsøvelsene",null,null,130,{"$f":"'1'!P37","v":"poeng"}]
[{"$f":"'1'!A38","v":"C"},"00:00:00",{"$f":"'1'!C38","v":"A"},"00:00:00",{"$f":"SUM(B38,D38)","v":"00:00:00"},null,null,null,null,null,null,{"$f":"'1'!L38:N38","v":"Cert/CACIT"},null,null,575,{"$f":"'1'!P38","v":"poeng"}]
[{"$f":"'1'!A39","v":"A"},"00:00:00",{"$f":"'1'!C39","v":"D"},"00:00:00",{"$f":"SUM(E35:J38)","v":"00:00:00"},null,null,null,null,null,null,{"$f":"'1'!L39:N39","v":"- Derav i spesialøvelsene"},null,null,312,{"$f":"'1'!P39","v":"poeng"}]
[{"$f":"'1'!A40","v":"Anvendt tid totalt:"},null,null,null,{"$f":"SUM(E36:J39)","v":"00:00:00"},null,null,null,null,null,null,{"$f":"'1'!L40:N40","v":"- Derav i lydighetsøvelsene"},null,null,208,{"$f":"'1'!P40","v":"poeng"}]
[{"$f":"'1'!A41","v":"Øvelser:"},null,null,null,null,{"$f":"'1'!F41","v":"Koeff."},{"$f":"'1'!G41","v":"Karakter"},{"$f":"'1'!H41","v":"Karakter"},"Snitt",{"$f":"'1'!J41","v":"Poeng"}]
[{"$f":"'1'!A42","v":11},{"$f":"'1'!B42","v":"Feltsøk"},null,null,null,10,null,null,{"$f":"IF(G42=\"\",\"\",IF(H42=\"\",\"\",(G42+H42)/2))","v":""},{"$f":"IF(I42=\"\",\"\",IF(I42=0,\"I.G.\",I42*F42))","v":""},null,null,null,null,{"$f":"'1'!O42:P42","v":"Poeng"}]
[{"$f":"'1'!A43","v":12},{"$f":"'1'!B43","v":"Rapport"},null,null,null,{"$f":"'1'!F43","v":29},null,null,{"$f":"IF(G43=\"\",\"\",IF(H43=\"\",\"\",(G43+H43)/2))","v":""},{"$f":"IF(I43=\"\",\"\",IF(I43=0,\"I.G.\",I43*F43))","v":""},null,{"$f":"'1'!L43:N43","v":"Sum Lydighet"},null,null,{"$f":"J22","v":0}]
[{"$f":"'1'!A44","v":"Sum spesialøvelser:"},null,null,null,null,{"$f":"SUM(F42:F43)","v":39},null,null,null,null,null,{"$f":"'1'!L44:N44","v":"Sum Spesialøvelser"},null,null,{"$f":"IF(Resultatskj!H4=\"Rundering\",J33,IF(Resultatskj!H4=\"Spor\",J28,IF(Resultatskj!H4=\"Rapport\",J44,\"\")))","v":""}]
[null,null,null,null,null,null,null,null,null,null,null,{"$f":"'1'!L45:N45","v":"Totalpoeng"},null,null,{"$f":"SUM(O43:P44)","v":0}]
[null,null,null,null,null,null,null,null,null,null,null,{"$f":"'1'!L46","v":"Ikke godkj."},{"$f":"'1'!M46","v":"Godkj."},null,{"$f":"'1'!O46","v":"Cert"},{"$f":"'1'!P46","v":"Plass"}]
[{"$f":"IF(Resultatskj!C3=\"\",\"\",Resultatskj!C3)","v":""},null,null,null,null,{"$f":"IF(Resultatskj!C4=\"\",\"\",Resultatskj!C4)","v":""},null,null,null,null,null,{"$f":"IF(OR(O45<O35,O44<O36,O43<O37,O45=\"\"),\"X\",\"\")","v":"X"},{"$f":"IF(AND(O45>=O35,O44>=O36,O43>=O37,L47=\"\"),\"X\",\"\")","v":""},null,{"$f":"IF(AND(O45>=575,O44>=311.99,O43>207.99,L47=\"\"),\"X\",\"\")","v":""},{"$f":"Resultatskj!A22","v":"-"}]
["Underskrift dommere",null,null,null,null,null,null,null,null,null,null,{"$f":"Resultatskj!K26","v":"B.Strand/A.Bakken 15.07.2015/19.06.2018"}]
[]
[{"$f":"IF(Resultatskj!$C$3=\"\",\"\",Resultatskj!$C$3)","v":""}]
[{"$f":"IF(Resultatskj!$C$4=\"\",\"\",Resultatskj!$C$4)","v":""}]